{"text_format":"3","workbook":"xlsx","n_sheets":8,"sheets":["Menu","Cad","Colab","Treinamentos","Plano","Dash1","Instruções","Tab"],"not_rendered":{"charts":4,"images":8,"macros":1,"external_links":1,"defined_names":14,"pivot_tables":6},"read":"whole","date_system":"1900"}

{"sheet":"Menu","index":0,"n_rows":26,"n_cols":7,"rows_kept":26,"merged":[[25,4,25,5],[25,6,25,14]]}
{"$rows_empty":25}
[{"$nulls":4},"Empresa:",null,"Empresa ABCDE"]

{"sheet":"Cad","index":1,"n_rows":34,"n_cols":14,"rows_kept":34,"merged":[[9,2,9,5],[11,1,11,2],[11,4,11,5],[12,1,13,1],[12,2,13,2],[12,4,13,4],[12,5,13,5]]}
{"$rows_empty":9}
[null,"Empresa:",{"$f":"Menu!G26","v":"Empresa ABCDE"}]
[]
[null,"CADASTRO DE FUNÇÕES\nInsira as funções utilizadas em sua empresa.",null,null,"CADASTRO DE DEPARTAMENTOS\nInsira os departamentos utilizados em sua empresa."]
[null,"ITEM","FUNÇÃO",null,"ITEM","DEPARTAMENTO"]
[{"$nulls":9},"Programado","Programado",null,"Concluído","Concluído"]
[null,1,"Auxiliar Administrativo",null,1,"Administrativo",{"$nulls":3},{"$f":"COUNTIFS(Plano!$C$14:$C$1000,F15,Plano!$M$14:$M$1000,$J$14)","v":0},{"$f":"SUMIFS(Plano!$L$14:$L$1000,Plano!$C$14:$C$1000,C15,Plano!$M$14:$M$1000,$K$14)","v":0},null,{"$f":"COUNTIFS(Plano!$C$14:$C$1000,F15,Plano!$M$14:$M$1000,$M$14)","v":1},{"$f":"SUMIFS(Plano!$L$14:$L$1000,Plano!$C$14:$C$1000,F15,Plano!$M$14:$M$1000,$N$14)","v":1000}]
[null,2,"Analista Administrativo",null,2,"Produção",{"$nulls":3},{"$f":"COUNTIFS(Plano!$C$14:$C$1000,F16,Plano!$M$14:$M$1000,$J$14)","v":1},{"$f":"SUMIFS(Plano!$L$14:$L$1000,Plano!$C$14:$C$1000,C16,Plano!$M$14:$M$1000,$K$14)","v":0},null,{"$f":"COUNTIFS(Plano!$C$14:$C$1000,F16,Plano!$M$14:$M$1000,$M$14)","v":0},{"$f":"SUMIFS(Plano!$L$14:$L$1000,Plano!$C$14:$C$1000,F16,Plano!$M$14:$M$1000,$N$14)","v":0}]
[null,3,"Recepcionista",null,3,{"$nulls":4},{"$f":"COUNTIFS(Plano!$C$14:$C$1000,F17,Plano!$M$14:$M$1000,$J$14)","v":0},{"$f":"SUMIFS(Plano!$L$14:$L$1000,Plano!$C$14:$C$1000,C17,Plano!$M$14:$M$1000,$K$14)","v":0},null,{"$f":"COUNTIFS(Plano!$C$14:$C$1000,F17,Plano!$M$14:$M$1000,$M$14)","v":0},{"$f":"SUMIFS(Plano!$L$14:$L$1000,Plano!$C$14:$C$1000,F17,Plano!$M$14:$M$1000,$N$14)","v":0}]
[null,4,"Gerente Geral",null,4,{"$nulls":4},{"$f":"COUNTIFS(Plano!$C$14:$C$1000,F18,Plano!$M$14:$M$1000,$J$14)","v":0},{"$f":"SUMIFS(Plano!$L$14:$L$1000,Plano!$C$14:$C$1000,C18,Plano!$M$14:$M$1000,$K$14)","v":0},null,{"$f":"COUNTIFS(Plano!$C$14:$C$1000,F18,Plano!$M$14:$M$1000,$M$14)","v":0},{"$f":"SUMIFS(Plano!$L$14:$L$1000,Plano!$C$14:$C$1000,F18,Plano!$M$14:$M$1000,$N$14)","v":0}]
[null,5,"Auxiliar de Produção",null,5,{"$nulls":4},{"$f":"COUNTIFS(Plano!$C$14:$C$1000,F19,Plano!$M$14:$M$1000,$J$14)","v":0},{"$f":"SUMIFS(Plano!$L$14:$L$1000,Plano!$C$14:$C$1000,C19,Plano!$M$14:$M$1000,$K$14)","v":0},null,{"$f":"COUNTIFS(Plano!$C$14:$C$1000,F19,Plano!$M$14:$M$1000,$M$14)","v":0},{"$f":"SUMIFS(Plano!$L$14:$L$1000,Plano!$C$14:$C$1000,F19,Plano!$M$14:$M$1000,$N$14)","v":0}]
[null,6,null,null,6,{"$nulls":4},{"$f":"COUNTIFS(Plano!$C$14:$C$1000,F20,Plano!$M$14:$M$1000,$J$14)","v":0},{"$f":"SUMIFS(Plano!$L$14:$L$1000,Plano!$C$14:$C$1000,C20,Plano!$M$14:$M$1000,$K$14)","v":0},null,{"$f":"COUNTIFS(Plano!$C$14:$C$1000,F20,Plano!$M$14:$M$1000,$M$14)","v":0},{"$f":"SUMIFS(Plano!$L$14:$L$1000,Plano!$C$14:$C$1000,F20,Plano!$M$14:$M$1000,$N$14)","v":0}]
[null,7,null,null,7,{"$nulls":4},{"$f":"COUNTIFS(Plano!$C$14:$C$1000,F21,Plano!$M$14:$M$1000,$J$14)","v":0},{"$f":"SUMIFS(Plano!$L$14:$L$1000,Plano!$C$14:$C$1000,C21,Plano!$M$14:$M$1000,$K$14)","v":0},null,{"$f":"COUNTIFS(Plano!$C$14:$C$1000,F21,Plano!$M$14:$M$1000,$M$14)","v":0},{"$f":"SUMIFS(Plano!$L$14:$L$1000,Plano!$C$14:$C$1000,F21,Plano!$M$14:$M$1000,$N$14)","v":0}]
[null,8,null,null,8,{"$nulls":4},{"$f":"COUNTIFS(Plano!$C$14:$C$1000,F22,Plano!$M$14:$M$1000,$J$14)","v":0},{"$f":"SUMIFS(Plano!$L$14:$L$1000,Plano!$C$14:$C$1000,C22,Plano!$M$14:$M$1000,$K$14)","v":0},null,{"$f":"COUNTIFS(Plano!$C$14:$C$1000,F22,Plano!$M$14:$M$1000,$M$14)","v":0},{"$f":"SUMIFS(Plano!$L$14:$L$1000,Plano!$C$14:$C$1000,F22,Plano!$M$14:$M$1000,$N$14)","v":0}]
[null,9,null,null,9,{"$nulls":4},{"$f":"COUNTIFS(Plano!$C$14:$C$1000,F23,Plano!$M$14:$M$1000,$J$14)","v":0},{"$f":"SUMIFS(Plano!$L$14:$L$1000,Plano!$C$14:$C$1000,C23,Plano!$M$14:$M$1000,$K$14)","v":0},null,{"$f":"COUNTIFS(Plano!$C$14:$C$1000,F23,Plano!$M$14:$M$1000,$M$14)","v":0},{"$f":"SUMIFS(Plano!$L$14:$L$1000,Plano!$C$14:$C$1000,F23,Plano!$M$14:$M$1000,$N$14)","v":0}]
{"$rows_left_out":12}
{"sheet":"Colab","index":2,"n_rows":63,"n_cols":14,"rows_kept":63,"merged":[[9,2,9,3],[11,1,11,3]]}
{"$rows_empty":9}
[null,"Empresa:",{"$f":"Menu!G26","v":"Empresa ABCDE"}]
[]
[null,"CADASTRO DE COLABORADORES\nInsira os dados dos seus colaboradores."]
[null,"Colaborador","Departamento","Função",{"$nulls":5},"Programado","Programado",null,"Concluído","Concluído"]
[null,"José da Silva","Administrativo","Assistente Administrativo",{"$nulls":5},{"$f":"COUNTIFS(Plano!$B$14:$B$1000,B14,Plano!$M$14:$M$1000,$J$13)","v":0},{"$f":"SUMIFS(Plano!$L$14:$L$1000,Plano!$B$14:$B$1000,B14,Plano!$M$14:$M$1000,$K$13)","v":0},null,{"$f":"COUNTIFS(Plano!$B$14:$B$1000,B14,Plano!$M$14:$M$1000,$M$13)","v":1},{"$f":"SUMIFS(Plano!$L$14:$L$1000,Plano!$B$14:$B$1000,B14,Plano!$M$14:$M$1000,$N$13)","v":1000}]
[null,"João Alves","Produção","Auxiliar de Produção",{"$nulls":5},{"$f":"COUNTIFS(Plano!$B$14:$B$1000,B15,Plano!$M$14:$M$1000,$J$13)","v":1},{"$f":"SUMIFS(Plano!$L$14:$L$1000,Plano!$B$14:$B$1000,B15,Plano!$M$14:$M$1000,$K$13)","v":500},null,{"$f":"COUNTIFS(Plano!$B$14:$B$1000,B15,Plano!$M$14:$M$1000,$M$13)","v":0},{"$f":"SUMIFS(Plano!$L$14:$L$1000,Plano!$B$14:$B$1000,B15,Plano!$M$14:$M$1000,$N$13)","v":0}]
[null,"Paulo Vitor","Administrativo","Analista Administrativo",{"$nulls":5},{"$f":"COUNTIFS(Plano!$B$14:$B$1000,B16,Plano!$M$14:$M$1000,$J$13)","v":0},{"$f":"SUMIFS(Plano!$L$14:$L$1000,Plano!$B$14:$B$1000,B16,Plano!$M$14:$M$1000,$K$13)","v":0},null,{"$f":"COUNTIFS(Plano!$B$14:$B$1000,B16,Plano!$M$14:$M$1000,$M$13)","v":0},{"$f":"SUMIFS(Plano!$L$14:$L$1000,Plano!$B$14:$B$1000,B16,Plano!$M$14:$M$1000,$N$13)","v":0}]
[{"$nulls":9},{"$f":"COUNTIFS(Plano!$B$14:$B$1000,B17,Plano!$M$14:$M$1000,$J$13)","v":0},{"$f":"SUMIFS(Plano!$L$14:$L$1000,Plano!$B$14:$B$1000,B17,Plano!$M$14:$M$1000,$K$13)","v":0},null,{"$f":"COUNTIFS(Plano!$B$14:$B$1000,B17,Plano!$M$14:$M$1000,$M$13)","v":0},{"$f":"SUMIFS(Plano!$L$14:$L$1000,Plano!$B$14:$B$1000,B17,Plano!$M$14:$M$1000,$N$13)","v":0}]
[{"$nulls":9},{"$f":"COUNTIFS(Plano!$B$14:$B$1000,B18,Plano!$M$14:$M$1000,$J$13)","v":0},{"$f":"SUMIFS(Plano!$L$14:$L$1000,Plano!$B$14:$B$1000,B18,Plano!$M$14:$M$1000,$K$13)","v":0},null,{"$f":"COUNTIFS(Plano!$B$14:$B$1000,B18,Plano!$M$14:$M$1000,$M$13)","v":0},{"$f":"SUMIFS(Plano!$L$14:$L$1000,Plano!$B$14:$B$1000,B18,Plano!$M$14:$M$1000,$N$13)","v":0}]
[{"$nulls":9},{"$f":"COUNTIFS(Plano!$B$14:$B$1000,B19,Plano!$M$14:$M$1000,$J$13)","v":0},{"$f":"SUMIFS(Plano!$L$14:$L$1000,Plano!$B$14:$B$1000,B19,Plano!$M$14:$M$1000,$K$13)","v":0},null,{"$f":"COUNTIFS(Plano!$B$14:$B$1000,B19,Plano!$M$14:$M$1000,$M$13)","v":0},{"$f":"SUMIFS(Plano!$L$14:$L$1000,Plano!$B$14:$B$1000,B19,Plano!$M$14:$M$1000,$N$13)","v":0}]
[{"$nulls":9},{"$f":"COUNTIFS(Plano!$B$14:$B$1000,B20,Plano!$M$14:$M$1000,$J$13)","v":0},{"$f":"SUMIFS(Plano!$L$14:$L$1000,Plano!$B$14:$B$1000,B20,Plano!$M$14:$M$1000,$K$13)","v":0},null,{"$f":"COUNTIFS(Plano!$B$14:$B$1000,B20,Plano!$M$14:$M$1000,$M$13)","v":0},{"$f":"SUMIFS(Plano!$L$14:$L$1000,Plano!$B$14:$B$1000,B20,Plano!$M$14:$M$1000,$N$13)","v":0}]
[{"$nulls":9},{"$f":"COUNTIFS(Plano!$B$14:$B$1000,B21,Plano!$M$14:$M$1000,$J$13)","v":0},{"$f":"SUMIFS(Plano!$L$14:$L$1000,Plano!$B$14:$B$1000,B21,Plano!$M$14:$M$1000,$K$13)","v":0},null,{"$f":"COUNTIFS(Plano!$B$14:$B$1000,B21,Plano!$M$14:$M$1000,$M$13)","v":0},{"$f":"SUMIFS(Plano!$L$14:$L$1000,Plano!$B$14:$B$1000,B21,Plano!$M$14:$M$1000,$N$13)","v":0}]
[{"$nulls":9},{"$f":"COUNTIFS(Plano!$B$14:$B$1000,B22,Plano!$M$14:$M$1000,$J$13)","v":0},{"$f":"SUMIFS(Plano!$L$14:$L$1000,Plano!$B$14:$B$1000,B22,Plano!$M$14:$M$1000,$K$13)","v":0},null,{"$f":"COUNTIFS(Plano!$B$14:$B$1000,B22,Plano!$M$14:$M$1000,$M$13)","v":0},{"$f":"SUMIFS(Plano!$L$14:$L$1000,Plano!$B$14:$B$1000,B22,Plano!$M$14:$M$1000,$N$13)","v":0}]
[{"$nulls":9},{"$f":"COUNTIFS(Plano!$B$14:$B$1000,B23,Plano!$M$14:$M$1000,$J$13)","v":0},{"$f":"SUMIFS(Plano!$L$14:$L$1000,Plano!$B$14:$B$1000,B23,Plano!$M$14:$M$1000,$K$13)","v":0},null,{"$f":"COUNTIFS(Plano!$B$14:$B$1000,B23,Plano!$M$14:$M$1000,$M$13)","v":0},{"$f":"SUMIFS(Plano!$L$14:$L$1000,Plano!$B$14:$B$1000,B23,Plano!$M$14:$M$1000,$N$13)","v":0}]
{"$rows_left_out":41}
{"sheet":"Treinamentos","index":3,"n_rows":43,"n_cols":17,"rows_kept":43,"merged":[[9,2,9,6],[11,1,11,6]]}
{"$rows_empty":9}
[null,"Empresa:",{"$f":"Menu!G26","v":"Empresa ABCDE"}]
[]
[null,"CADASTRO DE TREINAMENTOS\nInsira os treinamentos necessários para sua empresa."]
[null,"Treinamentos","Nome Capacitação","Descritivo Capacitação","Empresa Responsável","Carga Horária","Valor por Aluno",{"$nulls":5},"Programado","Programado",null,"Concluído","Concluído"]
[null,"Treinamento 1",{"$nulls":3},"8 horas",{"v":1000,"d":"R$1,000.00"},{"$nulls":5},{"$f":"COUNTIFS(Plano!$E$14:$E$1000,Treinamentos!B14,Plano!$M$14:$M$1000,Treinamentos!$M$13)","v":0},{"$f":"SUMIFS(Plano!$L$14:$L$1000,Plano!$E$14:$E$1000,Treinamentos!B14,Plano!$M$14:$M$1000,Treinamentos!$N$13)","v":0},null,{"$f":"COUNTIFS(Plano!$E$14:$E$1000,Treinamentos!B14,Plano!$M$14:$M$1000,Treinamentos!$P$13)","v":1},{"$f":"SUMIFS(Plano!$L$14:$L$1000,Plano!$E$14:$E$1000,Treinamentos!B14,Plano!$M$14:$M$1000,Treinamentos!$Q$13)","v":1000}]
[null,"Treinamento 2",{"$nulls":3},"4 horas",{"v":500,"d":"R$500.00"},{"$nulls":5},{"$f":"COUNTIF(Plano!$E$14:$E$1000,Treinamentos!B15)","v":1},{"$f":"SUMIFS(Plano!$L$14:$L$1000,Plano!$E$14:$E$1000,Treinamentos!B15,Plano!$M$14:$M$1000,Treinamentos!$N$13)","v":500},null,{"$f":"COUNTIFS(Plano!$E$14:$E$1000,Treinamentos!B15,Plano!$M$14:$M$1000,Treinamentos!$P$13)","v":0},{"$f":"SUMIFS(Plano!$L$14:$L$1000,Plano!$E$14:$E$1000,Treinamentos!B15,Plano!$M$14:$M$1000,Treinamentos!$Q$13)","v":0}]
[null,"Treinamento 3",{"$nulls":3},"2 horas",{"v":300,"d":"R$300.00"},{"$nulls":5},{"$f":"COUNTIF(Plano!$E$14:$E$1000,Treinamentos!B16)","v":1},{"$f":"SUMIFS(Plano!$L$14:$L$1000,Plano!$E$14:$E$1000,Treinamentos!B16,Plano!$M$14:$M$1000,Treinamentos!$N$13)","v":0},null,{"$f":"COUNTIFS(Plano!$E$14:$E$1000,Treinamentos!B16,Plano!$M$14:$M$1000,Treinamentos!$P$13)","v":0},{"$f":"SUMIFS(Plano!$L$14:$L$1000,Plano!$E$14:$E$1000,Treinamentos!B16,Plano!$M$14:$M$1000,Treinamentos!$Q$13)","v":0}]
[null,"Treinamento 4",{"$nulls":3},"2 horas",{"v":300,"d":"R$300.00"},{"$nulls":5},{"$f":"COUNTIF(Plano!$E$14:$E$1000,Treinamentos!B17)","v":0},{"$f":"SUMIFS(Plano!$L$14:$L$1000,Plano!$E$14:$E$1000,Treinamentos!B17,Plano!$M$14:$M$1000,Treinamentos!$N$13)","v":0},null,{"$f":"COUNTIFS(Plano!$E$14:$E$1000,Treinamentos!B17,Plano!$M$14:$M$1000,Treinamentos!$P$13)","v":0},{"$f":"SUMIFS(Plano!$L$14:$L$1000,Plano!$E$14:$E$1000,Treinamentos!B17,Plano!$M$14:$M$1000,Treinamentos!$Q$13)","v":0}]
[null,"Treinamento 5",{"$nulls":3},"2 horas",{"v":300,"d":"R$300.00"},{"$nulls":5},{"$f":"COUNTIF(Plano!$E$14:$E$1000,Treinamentos!B18)","v":0},{"$f":"SUMIFS(Plano!$L$14:$L$1000,Plano!$E$14:$E$1000,Treinamentos!B18,Plano!$M$14:$M$1000,Treinamentos!$N$13)","v":0},null,{"$f":"COUNTIFS(Plano!$E$14:$E$1000,Treinamentos!B18,Plano!$M$14:$M$1000,Treinamentos!$P$13)","v":0},{"$f":"SUMIFS(Plano!$L$14:$L$1000,Plano!$E$14:$E$1000,Treinamentos!B18,Plano!$M$14:$M$1000,Treinamentos!$Q$13)","v":0}]
[null,"Treinamento 6",{"$nulls":3},"2 horas",{"v":300,"d":"R$300.00"},{"$nulls":5},{"$f":"COUNTIF(Plano!$E$14:$E$1000,Treinamentos!B19)","v":0},{"$f":"SUMIFS(Plano!$L$14:$L$1000,Plano!$E$14:$E$1000,Treinamentos!B19,Plano!$M$14:$M$1000,Treinamentos!$N$13)","v":0},null,{"$f":"COUNTIFS(Plano!$E$14:$E$1000,Treinamentos!B19,Plano!$M$14:$M$1000,Treinamentos!$P$13)","v":0},{"$f":"SUMIFS(Plano!$L$14:$L$1000,Plano!$E$14:$E$1000,Treinamentos!B19,Plano!$M$14:$M$1000,Treinamentos!$Q$13)","v":0}]
[null,"Treinamento 7",{"$nulls":3},"2 horas",{"v":300,"d":"R$300.00"},{"$nulls":5},{"$f":"COUNTIF(Plano!$E$14:$E$1000,Treinamentos!B20)","v":0},{"$f":"SUMIFS(Plano!$L$14:$L$1000,Plano!$E$14:$E$1000,Treinamentos!B20,Plano!$M$14:$M$1000,Treinamentos!$N$13)","v":0},null,{"$f":"COUNTIFS(Plano!$E$14:$E$1000,Treinamentos!B20,Plano!$M$14:$M$1000,Treinamentos!$P$13)","v":0},{"$f":"SUMIFS(Plano!$L$14:$L$1000,Plano!$E$14:$E$1000,Treinamentos!B20,Plano!$M$14:$M$1000,Treinamentos!$Q$13)","v":0}]
[null,"Treinamento 8",{"$nulls":3},"2 horas",{"v":300,"d":"R$300.00"},{"$nulls":5},{"$f":"COUNTIF(Plano!$E$14:$E$1000,Treinamentos!B21)","v":0},{"$f":"SUMIFS(Plano!$L$14:$L$1000,Plano!$E$14:$E$1000,Treinamentos!B21,Plano!$M$14:$M$1000,Treinamentos!$N$13)","v":0},null,{"$f":"COUNTIFS(Plano!$E$14:$E$1000,Treinamentos!B21,Plano!$M$14:$M$1000,Treinamentos!$P$13)","v":0},{"$f":"SUMIFS(Plano!$L$14:$L$1000,Plano!$E$14:$E$1000,Treinamentos!B21,Plano!$M$14:$M$1000,Treinamentos!$Q$13)","v":0}]
[null,"Treinamento 9",{"$nulls":3},"2 horas",{"v":300,"d":"R$300.00"},{"$nulls":5},{"$f":"COUNTIF(Plano!$E$14:$E$1000,Treinamentos!B22)","v":0},{"$f":"SUMIFS(Plano!$L$14:$L$1000,Plano!$E$14:$E$1000,Treinamentos!B22,Plano!$M$14:$M$1000,Treinamentos!$N$13)","v":0},null,{"$f":"COUNTIFS(Plano!$E$14:$E$1000,Treinamentos!B22,Plano!$M$14:$M$1000,Treinamentos!$P$13)","v":0},{"$f":"SUMIFS(Plano!$L$14:$L$1000,Plano!$E$14:$E$1000,Treinamentos!B22,Plano!$M$14:$M$1000,Treinamentos!$Q$13)","v":0}]
[null,"Treinamento 10",{"$nulls":3},"2 horas",{"v":300,"d":"R$300.00"},{"$nulls":5},{"$f":"COUNTIF(Plano!$E$14:$E$1000,Treinamentos!B23)","v":0},{"$f":"SUMIFS(Plano!$L$14:$L$1000,Plano!$E$14:$E$1000,Treinamentos!B23,Plano!$M$14:$M$1000,Treinamentos!$N$13)","v":0},null,{"$f":"COUNTIFS(Plano!$E$14:$E$1000,Treinamentos!B23,Plano!$M$14:$M$1000,Treinamentos!$P$13)","v":0},{"$f":"SUMIFS(Plano!$L$14:$L$1000,Plano!$E$14:$E$1000,Treinamentos!B23,Plano!$M$14:$M$1000,Treinamentos!$Q$13)","v":0}]
{"$rows_left_out":21}
{"sheet":"Plano","index":4,"n_rows":1000,"n_cols":17,"rows_kept":1000,"merged":[[9,2,9,12],[11,1,11,12]]}
{"$rows_empty":9}
[null,"Empresa:",{"$f":"Menu!G26","v":"Empresa ABCDE"}]
[]
[null,"PLANEJAMENTO DE TREINAMENTOS\nInsira os treinamentos previstos e acompanhe os treinamentos ."]
[null,"Colaborador","Área","Cargo","Treinamento","Carga Horária","Objetivo","Motivo Treinamento","Data Início","Data Término","Certificado Entregue","Investimento","Status",{"$nulls":3},"Média"]
[null,"José da Silva",{"$f":"IF(B14=\"\",\"\",VLOOKUP(B14,Colab!$B$14:$D$63,2,0))","v":"Administrativo"},{"$f":"IF(B14=\"\",\"\",VLOOKUP(B14,Colab!$B$14:$D$63,3,0))","v":"Assistente Administrativo"},"Treinamento 1",{"$f":"IF(E14=\"\",\"\",VLOOKUP(E14,Treinamentos!$B$14:$G$43,5,0))","v":"8 horas"},{"$nulls":4},"Sim",{"$f":"IF(E14=\"\",\"\",VLOOKUP(E14,Treinamentos!$B$14:$G$43,6,0))","v":{"v":1000,"d":"R$1,000.00"}},"Concluído",{"$nulls":3},{"$f":"IFERROR(AVERAGEIF(C14:M14,\">0\"),\"\")","v":1000}]
[null,"João Alves",{"$f":"IF(B15=\"\",\"\",VLOOKUP(B15,Colab!$B$14:$D$63,2,0))","v":"Produção"},{"$f":"IF(B15=\"\",\"\",VLOOKUP(B15,Colab!$B$14:$D$63,3,0))","v":"Auxiliar de Produção"},"Treinamento 2",{"$f":"IF(E15=\"\",\"\",VLOOKUP(E15,Treinamentos!$B$14:$G$43,5,0))","v":"4 horas"},{"$nulls":5},{"$f":"IF(E15=\"\",\"\",VLOOKUP(E15,Treinamentos!$B$14:$G$43,6,0))","v":{"v":500,"d":"R$500.00"}},"Programado",{"$nulls":3},500]
[null,"João Alves",{"$f":"IF(B16=\"\",\"\",VLOOKUP(B16,Colab!$B$14:$D$63,2,0))","v":"Produção"},{"$f":"IF(B16=\"\",\"\",VLOOKUP(B16,Colab!$B$14:$D$63,3,0))","v":"Auxiliar de Produção"},"Treinamento 3",{"$f":"IF(E16=\"\",\"\",VLOOKUP(E16,Treinamentos!$B$14:$G$43,5,0))","v":"2 horas"},{"$nulls":5},{"$f":"IF(E16=\"\",\"\",VLOOKUP(E16,Treinamentos!$B$14:$G$43,6,0))","v":{"v":300,"d":"R$300.00"}},"Cancelado",{"$nulls":3},300]
[null,null,{"$f":"IF(B17=\"\",\"\",VLOOKUP(B17,Colab!$B$14:$D$63,2,0))","v":""},{"$f":"IF(B17=\"\",\"\",VLOOKUP(B17,Colab!$B$14:$D$63,3,0))","v":""},null,{"$f":"IF(E17=\"\",\"\",VLOOKUP(E17,Treinamentos!$B$14:$G$43,5,0))","v":""},{"$nulls":5},{"$f":"IF(E17=\"\",\"\",VLOOKUP(E17,Treinamentos!$B$14:$G$43,6,0))","v":""},{"$nulls":4},""]
[null,null,{"$f":"IF(B18=\"\",\"\",VLOOKUP(B18,Colab!$B$14:$D$63,2,0))","v":""},{"$f":"IF(B18=\"\",\"\",VLOOKUP(B18,Colab!$B$14:$D$63,3,0))","v":""},null,{"$f":"IF(E18=\"\",\"\",VLOOKUP(E18,Treinamentos!$B$14:$G$43,5,0))","v":""},{"$nulls":5},{"$f":"IF(E18=\"\",\"\",VLOOKUP(E18,Treinamentos!$B$14:$G$43,6,0))","v":""},{"$nulls":4},""]
[null,null,{"$f":"IF(B19=\"\",\"\",VLOOKUP(B19,Colab!$B$14:$D$63,2,0))","v":""},{"$f":"IF(B19=\"\",\"\",VLOOKUP(B19,Colab!$B$14:$D$63,3,0))","v":""},null,{"$f":"IF(E19=\"\",\"\",VLOOKUP(E19,Treinamentos!$B$14:$G$43,5,0))","v":""},{"$nulls":5},{"$f":"IF(E19=\"\",\"\",VLOOKUP(E19,Treinamentos!$B$14:$G$43,6,0))","v":""},{"$nulls":4},""]
[null,null,{"$f":"IF(B20=\"\",\"\",VLOOKUP(B20,Colab!$B$14:$D$63,2,0))","v":""},{"$f":"IF(B20=\"\",\"\",VLOOKUP(B20,Colab!$B$14:$D$63,3,0))","v":""},null,{"$f":"IF(E20=\"\",\"\",VLOOKUP(E20,Treinamentos!$B$14:$G$43,5,0))","v":""},{"$nulls":5},{"$f":"IF(E20=\"\",\"\",VLOOKUP(E20,Treinamentos!$B$14:$G$43,6,0))","v":""},{"$nulls":4},""]
[null,null,{"$f":"IF(B21=\"\",\"\",VLOOKUP(B21,Colab!$B$14:$D$63,2,0))","v":""},{"$f":"IF(B21=\"\",\"\",VLOOKUP(B21,Colab!$B$14:$D$63,3,0))","v":""},null,{"$f":"IF(E21=\"\",\"\",VLOOKUP(E21,Treinamentos!$B$14:$G$43,5,0))","v":""},{"$nulls":5},{"$f":"IF(E21=\"\",\"\",VLOOKUP(E21,Treinamentos!$B$14:$G$43,6,0))","v":""},{"$nulls":4},""]
[null,null,{"$f":"IF(B22=\"\",\"\",VLOOKUP(B22,Colab!$B$14:$D$63,2,0))","v":""},{"$f":"IF(B22=\"\",\"\",VLOOKUP(B22,Colab!$B$14:$D$63,3,0))","v":""},null,{"$f":"IF(E22=\"\",\"\",VLOOKUP(E22,Treinamentos!$B$14:$G$43,5,0))","v":""},{"$nulls":5},{"$f":"IF(E22=\"\",\"\",VLOOKUP(E22,Treinamentos!$B$14:$G$43,6,0))","v":""},{"$nulls":4},""]
[null,null,{"$f":"IF(B23=\"\",\"\",VLOOKUP(B23,Colab!$B$14:$D$63,2,0))","v":""},{"$f":"IF(B23=\"\",\"\",VLOOKUP(B23,Colab!$B$14:$D$63,3,0))","v":""},null,{"$f":"IF(E23=\"\",\"\",VLOOKUP(E23,Treinamentos!$B$14:$G$43,5,0))","v":""},{"$nulls":5},{"$f":"IF(E23=\"\",\"\",VLOOKUP(E23,Treinamentos!$B$14:$G$43,6,0))","v":""},{"$nulls":4},""]
{"$rows_left_out":978}
{"sheet":"Dash1","index":5,"n_rows":54,"n_cols":12,"rows_kept":54,"merged":[[10,1,10,2],[10,3,10,20],[51,3,51,5],[51,7,51,9],[51,11,51,13],[53,3,53,5],[53,7,53,9],[53,11,53,13]]}
{"$rows_empty":10}
[null,"Empresa:",null,{"$f":"Menu!G26","v":"Empresa ABCDE"}]
{"$rows_empty":38}
[null,"Investimentos Individuais:",{"$nulls":9},"Quantidade de Treinamentos"]
[]
[null,"Colaborador:",null,"José da Silva",{"$nulls":3},{"$f":"IF(D52=\"\",\"\",VLOOKUP(D52,Colab!$B$14:$N$63,13,0))","v":{"v":1000,"d":"R$1,000.00"}},{"$nulls":3},{"$f":"IF(D52=\"\",\"\",VLOOKUP(D52,Colab!$B$14:$N$63,12,0))","v":1}]
[]
[null,"Departamento:",null,"Administrativo",{"$nulls":3},{"$f":"IF(D54=\"\",\"\",VLOOKUP(D54,Cad!$F$15:$N$34,9,0))","v":{"v":1000,"d":"R$1,000.00"}},{"$nulls":3},{"$f":"IF(D54=\"\",\"\",VLOOKUP(D54,Cad!$F$15:$N$34,8,0))","v":1}]

{"sheet":"Instruções","index":6,"n_rows":0,"n_cols":0,"rows_kept":0}

{"sheet":"Tab","index":7,"n_rows":4,"n_cols":24,"rows_kept":4}
["Soma de Investimento","Rótulos de Coluna",{"$nulls":3},"Status","Concluído",null,null,"Soma de Investimento","Rótulos de Coluna",null,null,"Contagem de Investimento","Rótulos de Coluna",{"$nulls":3},"Contagem de Investimento","Rótulos de Coluna",null,null,"Status","Concluído"]
["Rótulos de Linha","Concluído","Programado",{"$nulls":6},"Rótulos de Linha","Concluído",null,null,"Rótulos de Linha","Concluído","Programado",null,null,"Rótulos de Linha","Concluído"]
["Administrativo",{"v":1000,"d":"R$1,000.00"},{"$nulls":3},"Soma de Investimento",{"$nulls":3},"Administrativo",{"v":1000,"d":"R$1,000.00"},null,null,"Administrativo",1,{"$nulls":3},"Administrativo",1,null,null,"Contagem de Investimento"]
["Produção",null,{"v":500,"d":"R$500.00"},null,null,{"v":1000,"d":"R$1,000.00"},{"$nulls":7},"Produção",null,1,{"$nulls":6},1]