{"text_format":"3","workbook":"xlsx","n_sheets":9,"sheets":["Menu","PERFIL","RESP","RELAT","PESQ","Dash","Dash (2)","Instruções","calc"],"not_rendered":{"charts":5,"images":9,"macros":1,"defined_names":14},"read":"whole","date_system":"1900"}

{"sheet":"Menu","index":0,"n_rows":0,"n_cols":0,"rows_kept":0}

{"sheet":"PERFIL","index":1,"n_rows":115,"n_cols":8,"rows_kept":115,"merged":[[8,4,9,4],[11,3,11,7],[12,1,13,1],[12,3,13,3],[12,4,13,4],[12,5,13,5],[12,6,13,6],[12,7,13,7]]}
{"$rows_empty":11}
[null,"Cadastro de Perfil\nInsira os perfis que melhor representa seu público-alvo.",null,"Cadastro de Entrevistados\nInsira as informações dos entrevistados."]
[null,"Perfil",null,"Entrevistado","Perfil do Entrevistado","Telefone","E-mail","Idade"]
[]
[null,"Perfil 1",null,"Entrevistado 1","Perfil 1","9999-9999","entrevistado1@123.com.br",35]
[null,"Perfil 2",null,"Entrevistado 2","Perfil 1","8888-8888","entrevistado2@123.com.br",28]
[null,"Perfil 3",null,"Entrevistado 3","Perfil 2","7777-7777","entrevistado3@123.com.br",22]
[null,"Perfil 4",null,"Entrevistado 4","Perfil 3","6666-6666","entrevistado4@123.com.br",29]
{"$rows_left_out":9}
{"sheet":"RESP","index":2,"n_rows":41,"n_cols":7,"rows_kept":41,"merged":[[11,1,11,3],[11,5,11,6],[12,1,13,1],[12,2,13,2],[12,3,13,3],[12,5,13,5],[12,6,13,6]]}
{"$rows_empty":11}
[null,"Tipo de Resposta\nInsira as configurações do tipo de resposta.",{"$nulls":3},"Cadastro de Perguntas\nInsira as perguntas relevantes para seu público-alvo."]
[null,"Binária","Avaliação","Qualitativa",null,"Pergunta","Tipo de Resposta"]
[]
[null,"Sim","Excelente",1,null,"Você já experimentou algum produto dessa marca?","Binária"]
[null,"Não","Bom",2,null,"O que achou da embalagem do produto?","Avaliação"]
[null,null,"Ruim",3,null,"Você conhece a Marca X","Qualitativa"]
[null,null,"Péssimo",4,null,"Você usaria esse produto no seu dia-a-dia?","Binária"]
{"$rows_left_out":9}
{"sheet":"RELAT","index":3,"n_rows":31,"n_cols":28,"rows_kept":31,"merged":[[11,1,12,1],[11,2,12,2],[11,3,12,3],[11,4,12,4],[11,5,12,5],[11,6,12,6],[11,7,12,7],[11,8,12,8],[11,9,12,9],[11,10,12,10],[11,11,12,11],[11,12,12,12],[11,13,12,13],[11,14,12,14],[11,15,12,15],[11,16,12,16],[11,17,12,17],[11,18,12,18],[11,19,12,19],[11,20,12,20],[11,21,12,21],[11,22,12,22],[11,23,12,23],[11,24,12,24],[11,25,12,25],[11,26,12,26],[11,27,12,27],[11,28,12,28],[11,29,12,29],[11,30,12,30],[11,31,12,31],[11,32,12,32],[11,33,12,33],[11,34,12,34],[11,35,12,35],[11,36,12,36],[11,37,12,37],[11,38,12,38],[11,39,12,39],[11,40,12,40],[11,41,12,41],[11,42,12,42],[11,43,12,43],[11,44,12,44],[11,45,12,45],[11,46,12,46],[11,47,12,47],[11,48,12,48],[11,49,12,49],[11,50,12,50],[11,51,12,51]]}
{"$rows_empty":11}
[null,"Perguntas",{"$f":"RESP!$F$15","v":"Você já experimentou algum produto dessa marca?"},{"$f":"RESP!$F$16","v":"O que achou da embalagem do produto?"},{"$f":"RESP!$F$17","v":"Você conhece a Marca X"},{"$f":"RESP!$F$18","v":"Você usaria esse produto no seu dia-a-dia?"},{"$f":"RESP!$F$19","v":"Esse produto atende as suas necessidades?"},{"$f":"RESP!$F$20","v":"O que achou do preço do produto?"},{"$f":"RESP!$F$21","v":0},{"$f":"RESP!$F$22","v":0},{"$f":"RESP!$F$23","v":0},{"$f":"RESP!$F$24","v":0},{"$f":"RESP!$F$25","v":0},{"$f":"RESP!$F$26","v":0},{"$f":"RESP!$F$27","v":0},{"$f":"RESP!$F$28","v":0},{"$f":"RESP!$F$29","v":0},{"$f":"RESP!$F$30","v":0},{"$f":"RESP!$F$31","v":0},{"$f":"RESP!$F$32","v":0},{"$f":"RESP!$F$33","v":0},{"$f":"RESP!$F$34","v":0},{"$f":"RESP!$F$35","v":0},{"$f":"RESP!$F$36","v":0},{"$f":"RESP!$F$37","v":0},{"$f":"RESP!$F$38","v":0},{"$f":"RESP!$F$39","v":0},{"$f":"RESP!$F$40","v":0}]
[]
[null,"Total de Respostas",{"$f":"COUNTA(PESQ!C14:C113)","v":5},{"$f":"COUNTA(PESQ!D14:D113)","v":5},{"$f":"COUNTA(PESQ!E14:E113)","v":5},{"$f":"COUNTA(PESQ!F14:F113)","v":5},{"$f":"COUNTA(PESQ!G14:G113)","v":5},{"$f":"COUNTA(PESQ!H14:H113)","v":5},{"$f":"COUNTA(PESQ!I14:I113)","v":0},{"$f":"COUNTA(PESQ!J14:J113)","v":0},{"$f":"COUNTA(PESQ!K14:K113)","v":0},{"$f":"COUNTA(PESQ!L14:L113)","v":0},{"$f":"COUNTA(PESQ!M14:M113)","v":0},{"$f":"COUNTA(PESQ!N14:N113)","v":0},{"$f":"COUNTA(PESQ!O14:O113)","v":0},{"$f":"COUNTA(PESQ!P14:P113)","v":0},{"$f":"COUNTA(PESQ!Q14:Q113)","v":0},{"$f":"COUNTA(PESQ!R14:R113)","v":0},{"$f":"COUNTA(PESQ!S14:S113)","v":0},{"$f":"COUNTA(PESQ!T14:T113)","v":0},{"$f":"COUNTA(PESQ!U14:U113)","v":0},{"$f":"COUNTA(PESQ!V14:V113)","v":0},{"$f":"COUNTA(PESQ!W14:W113)","v":0},{"$f":"COUNTA(PESQ!X14:X113)","v":0},{"$f":"COUNTA(PESQ!Y14:Y113)","v":0},{"$f":"COUNTA(PESQ!Z14:Z113)","v":0},{"$f":"COUNTA(PESQ!AA14:AA113)","v":0},{"$f":"COUNTA(PESQ!AB14:AB113)","v":0}]
[null,"Sim",{"$f":"IF(C$14=0,\"\",IF(C$31<>\"bin\",\"Não se aplica\",COUNTIF(PESQ!C$14:C$113,RELAT!$B15)))","v":2},{"$f":"IF(D$14=0,\"\",IF(D$31<>\"bin\",\"Não se aplica\",COUNTIF(PESQ!D$14:D$113,RELAT!$B15)))","v":"Não se aplica"},{"$f":"IF(E$14=0,\"\",IF(E$31<>\"bin\",\"Não se aplica\",COUNTIF(PESQ!E$14:E$113,RELAT!$B15)))","v":"Não se aplica"},{"$f":"IF(F$14=0,\"\",IF(F$31<>\"bin\",\"Não se aplica\",COUNTIF(PESQ!F$14:F$113,RELAT!$B15)))","v":3},{"$f":"IF(G$14=0,\"\",IF(G$31<>\"bin\",\"Não se aplica\",COUNTIF(PESQ!G$14:G$113,RELAT!$B15)))","v":2},{"$f":"IF(H$14=0,\"\",IF(H$31<>\"bin\",\"Não se aplica\",COUNTIF(PESQ!H$14:H$113,RELAT!$B15)))","v":"Não se aplica"},{"$f":"IF(I$14=0,\"\",IF(I$31<>\"bin\",\"Não se aplica\",COUNTIF(PESQ!I$14:I$113,RELAT!$B15)))","v":""},{"$f":"IF(J$14=0,\"\",IF(J$31<>\"bin\",\"Não se aplica\",COUNTIF(PESQ!J$14:J$113,RELAT!$B15)))","v":""},{"$f":"IF(K$14=0,\"\",IF(K$31<>\"bin\",\"Não se aplica\",COUNTIF(PESQ!K$14:K$113,RELAT!$B15)))","v":""},{"$f":"IF(L$14=0,\"\",IF(L$31<>\"bin\",\"Não se aplica\",COUNTIF(PESQ!L$14:L$113,RELAT!$B15)))","v":""},{"$f":"IF(M$14=0,\"\",IF(M$31<>\"bin\",\"Não se aplica\",COUNTIF(PESQ!M$14:M$113,RELAT!$B15)))","v":""},{"$f":"IF(N$14=0,\"\",IF(N$31<>\"bin\",\"Não se aplica\",COUNTIF(PESQ!N$14:N$113,RELAT!$B15)))","v":""},{"$f":"IF(O$14=0,\"\",IF(O$31<>\"bin\",\"Não se aplica\",COUNTIF(PESQ!O$14:O$113,RELAT!$B15)))","v":""},{"$f":"IF(P$14=0,\"\",IF(P$31<>\"bin\",\"Não se aplica\",COUNTIF(PESQ!P$14:P$113,RELAT!$B15)))","v":""},{"$f":"IF(Q$14=0,\"\",IF(Q$31<>\"bin\",\"Não se aplica\",COUNTIF(PESQ!Q$14:Q$113,RELAT!$B15)))","v":""},{"$f":"IF(R$14=0,\"\",IF(R$31<>\"bin\",\"Não se aplica\",COUNTIF(PESQ!R$14:R$113,RELAT!$B15)))","v":""},{"$f":"IF(S$14=0,\"\",IF(S$31<>\"bin\",\"Não se aplica\",COUNTIF(PESQ!S$14:S$113,RELAT!$B15)))","v":""},{"$f":"IF(T$14=0,\"\",IF(T$31<>\"bin\",\"Não se aplica\",COUNTIF(PESQ!T$14:T$113,RELAT!$B15)))","v":""},{"$f":"IF(U$14=0,\"\",IF(U$31<>\"bin\",\"Não se aplica\",COUNTIF(PESQ!U$14:U$113,RELAT!$B15)))","v":""},{"$f":"IF(V$14=0,\"\",IF(V$31<>\"bin\",\"Não se aplica\",COUNTIF(PESQ!V$14:V$113,RELAT!$B15)))","v":""},{"$f":"IF(W$14=0,\"\",IF(W$31<>\"bin\",\"Não se aplica\",COUNTIF(PESQ!W$14:W$113,RELAT!$B15)))","v":""},{"$f":"IF(X$14=0,\"\",IF(X$31<>\"bin\",\"Não se aplica\",COUNTIF(PESQ!X$14:X$113,RELAT!$B15)))","v":""},{"$f":"IF(Y$14=0,\"\",IF(Y$31<>\"bin\",\"Não se aplica\",COUNTIF(PESQ!Y$14:Y$113,RELAT!$B15)))","v":""},{"$f":"IF(Z$14=0,\"\",IF(Z$31<>\"bin\",\"Não se aplica\",COUNTIF(PESQ!Z$14:Z$113,RELAT!$B15)))","v":""},{"$f":"IF(AA$14=0,\"\",IF(AA$31<>\"bin\",\"Não se aplica\",COUNTIF(PESQ!AA$14:AA$113,RELAT!$B15)))","v":""},{"$f":"IF(AB$14=0,\"\",IF(AB$31<>\"bin\",\"Não se aplica\",COUNTIF(PESQ!AB$14:AB$113,RELAT!$B15)))","v":""}]
[null,"Não",{"$f":"IF(C$14=0,\"\",IF(C$31<>\"bin\",\"Não se aplica\",COUNTIF(PESQ!C$14:C$113,RELAT!$B16)))","v":3},{"$f":"IF(D$14=0,\"\",IF(D$31<>\"bin\",\"Não se aplica\",COUNTIF(PESQ!D$14:D$113,RELAT!$B16)))","v":"Não se aplica"},{"$f":"IF(E$14=0,\"\",IF(E$31<>\"bin\",\"Não se aplica\",COUNTIF(PESQ!E$14:E$113,RELAT!$B16)))","v":"Não se aplica"},{"$f":"IF(F$14=0,\"\",IF(F$31<>\"bin\",\"Não se aplica\",COUNTIF(PESQ!F$14:F$113,RELAT!$B16)))","v":2},{"$f":"IF(G$14=0,\"\",IF(G$31<>\"bin\",\"Não se aplica\",COUNTIF(PESQ!G$14:G$113,RELAT!$B16)))","v":3},{"$f":"IF(H$14=0,\"\",IF(H$31<>\"bin\",\"Não se aplica\",COUNTIF(PESQ!H$14:H$113,RELAT!$B16)))","v":"Não se aplica"},{"$f":"IF(I$14=0,\"\",IF(I$31<>\"bin\",\"Não se aplica\",COUNTIF(PESQ!I$14:I$113,RELAT!$B16)))","v":""},{"$f":"IF(J$14=0,\"\",IF(J$31<>\"bin\",\"Não se aplica\",COUNTIF(PESQ!J$14:J$113,RELAT!$B16)))","v":""},{"$f":"IF(K$14=0,\"\",IF(K$31<>\"bin\",\"Não se aplica\",COUNTIF(PESQ!K$14:K$113,RELAT!$B16)))","v":""},{"$f":"IF(L$14=0,\"\",IF(L$31<>\"bin\",\"Não se aplica\",COUNTIF(PESQ!L$14:L$113,RELAT!$B16)))","v":""},{"$f":"IF(M$14=0,\"\",IF(M$31<>\"bin\",\"Não se aplica\",COUNTIF(PESQ!M$14:M$113,RELAT!$B16)))","v":""},{"$f":"IF(N$14=0,\"\",IF(N$31<>\"bin\",\"Não se aplica\",COUNTIF(PESQ!N$14:N$113,RELAT!$B16)))","v":""},{"$f":"IF(O$14=0,\"\",IF(O$31<>\"bin\",\"Não se aplica\",COUNTIF(PESQ!O$14:O$113,RELAT!$B16)))","v":""},{"$f":"IF(P$14=0,\"\",IF(P$31<>\"bin\",\"Não se aplica\",COUNTIF(PESQ!P$14:P$113,RELAT!$B16)))","v":""},{"$f":"IF(Q$14=0,\"\",IF(Q$31<>\"bin\",\"Não se aplica\",COUNTIF(PESQ!Q$14:Q$113,RELAT!$B16)))","v":""},{"$f":"IF(R$14=0,\"\",IF(R$31<>\"bin\",\"Não se aplica\",COUNTIF(PESQ!R$14:R$113,RELAT!$B16)))","v":""},{"$f":"IF(S$14=0,\"\",IF(S$31<>\"bin\",\"Não se aplica\",COUNTIF(PESQ!S$14:S$113,RELAT!$B16)))","v":""},{"$f":"IF(T$14=0,\"\",IF(T$31<>\"bin\",\"Não se aplica\",COUNTIF(PESQ!T$14:T$113,RELAT!$B16)))","v":""},{"$f":"IF(U$14=0,\"\",IF(U$31<>\"bin\",\"Não se aplica\",COUNTIF(PESQ!U$14:U$113,RELAT!$B16)))","v":""},{"$f":"IF(V$14=0,\"\",IF(V$31<>\"bin\",\"Não se aplica\",COUNTIF(PESQ!V$14:V$113,RELAT!$B16)))","v":""},{"$f":"IF(W$14=0,\"\",IF(W$31<>\"bin\",\"Não se aplica\",COUNTIF(PESQ!W$14:W$113,RELAT!$B16)))","v":""},{"$f":"IF(X$14=0,\"\",IF(X$31<>\"bin\",\"Não se aplica\",COUNTIF(PESQ!X$14:X$113,RELAT!$B16)))","v":""},{"$f":"IF(Y$14=0,\"\",IF(Y$31<>\"bin\",\"Não se aplica\",COUNTIF(PESQ!Y$14:Y$113,RELAT!$B16)))","v":""},{"$f":"IF(Z$14=0,\"\",IF(Z$31<>\"bin\",\"Não se aplica\",COUNTIF(PESQ!Z$14:Z$113,RELAT!$B16)))","v":""},{"$f":"IF(AA$14=0,\"\",IF(AA$31<>\"bin\",\"Não se aplica\",COUNTIF(PESQ!AA$14:AA$113,RELAT!$B16)))","v":""},{"$f":"IF(AB$14=0,\"\",IF(AB$31<>\"bin\",\"Não se aplica\",COUNTIF(PESQ!AB$14:AB$113,RELAT!$B16)))","v":""}]
[null,"Excelente",{"$f":"IF(C$14=0,\"\",IF(C$31<>\"avaliacao\",\"Não se aplica\",COUNTIF(PESQ!C$14:C$113,RELAT!$B17)))","v":"Não se aplica"},{"$f":"IF(D$14=0,\"\",IF(D$31<>\"avaliacao\",\"Não se aplica\",COUNTIF(PESQ!D$14:D$113,RELAT!$B17)))","v":2},{"$f":"IF(E$14=0,\"\",IF(E$31<>\"avaliacao\",\"Não se aplica\",COUNTIF(PESQ!E$14:E$113,RELAT!$B17)))","v":"Não se aplica"},{"$f":"IF(F$14=0,\"\",IF(F$31<>\"avaliacao\",\"Não se aplica\",COUNTIF(PESQ!F$14:F$113,RELAT!$B17)))","v":"Não se aplica"},{"$f":"IF(G$14=0,\"\",IF(G$31<>\"avaliacao\",\"Não se aplica\",COUNTIF(PESQ!G$14:G$113,RELAT!$B17)))","v":"Não se aplica"},{"$f":"IF(H$14=0,\"\",IF(H$31<>\"avaliacao\",\"Não se aplica\",COUNTIF(PESQ!H$14:H$113,RELAT!$B17)))","v":1},{"$f":"IF(I$14=0,\"\",IF(I$31<>\"avaliacao\",\"Não se aplica\",COUNTIF(PESQ!I$14:I$113,RELAT!$B17)))","v":""},{"$f":"IF(J$14=0,\"\",IF(J$31<>\"avaliacao\",\"Não se aplica\",COUNTIF(PESQ!J$14:J$113,RELAT!$B17)))","v":""},{"$f":"IF(K$14=0,\"\",IF(K$31<>\"avaliacao\",\"Não se aplica\",COUNTIF(PESQ!K$14:K$113,RELAT!$B17)))","v":""},{"$f":"IF(L$14=0,\"\",IF(L$31<>\"avaliacao\",\"Não se aplica\",COUNTIF(PESQ!L$14:L$113,RELAT!$B17)))","v":""},{"$f":"IF(M$14=0,\"\",IF(M$31<>\"avaliacao\",\"Não se aplica\",COUNTIF(PESQ!M$14:M$113,RELAT!$B17)))","v":""},{"$f":"IF(N$14=0,\"\",IF(N$31<>\"avaliacao\",\"Não se aplica\",COUNTIF(PESQ!N$14:N$113,RELAT!$B17)))","v":""},{"$f":"IF(O$14=0,\"\",IF(O$31<>\"avaliacao\",\"Não se aplica\",COUNTIF(PESQ!O$14:O$113,RELAT!$B17)))","v":""},{"$f":"IF(P$14=0,\"\",IF(P$31<>\"avaliacao\",\"Não se aplica\",COUNTIF(PESQ!P$14:P$113,RELAT!$B17)))","v":""},{"$f":"IF(Q$14=0,\"\",IF(Q$31<>\"avaliacao\",\"Não se aplica\",COUNTIF(PESQ!Q$14:Q$113,RELAT!$B17)))","v":""},{"$f":"IF(R$14=0,\"\",IF(R$31<>\"avaliacao\",\"Não se aplica\",COUNTIF(PESQ!R$14:R$113,RELAT!$B17)))","v":""},{"$f":"IF(S$14=0,\"\",IF(S$31<>\"avaliacao\",\"Não se aplica\",COUNTIF(PESQ!S$14:S$113,RELAT!$B17)))","v":""},{"$f":"IF(T$14=0,\"\",IF(T$31<>\"avaliacao\",\"Não se aplica\",COUNTIF(PESQ!T$14:T$113,RELAT!$B17)))","v":""},{"$f":"IF(U$14=0,\"\",IF(U$31<>\"avaliacao\",\"Não se aplica\",COUNTIF(PESQ!U$14:U$113,RELAT!$B17)))","v":""},{"$f":"IF(V$14=0,\"\",IF(V$31<>\"avaliacao\",\"Não se aplica\",COUNTIF(PESQ!V$14:V$113,RELAT!$B17)))","v":""},{"$f":"IF(W$14=0,\"\",IF(W$31<>\"avaliacao\",\"Não se aplica\",COUNTIF(PESQ!W$14:W$113,RELAT!$B17)))","v":""},{"$f":"IF(X$14=0,\"\",IF(X$31<>\"avaliacao\",\"Não se aplica\",COUNTIF(PESQ!X$14:X$113,RELAT!$B17)))","v":""},{"$f":"IF(Y$14=0,\"\",IF(Y$31<>\"avaliacao\",\"Não se aplica\",COUNTIF(PESQ!Y$14:Y$113,RELAT!$B17)))","v":""},{"$f":"IF(Z$14=0,\"\",IF(Z$31<>\"avaliacao\",\"Não se aplica\",COUNTIF(PESQ!Z$14:Z$113,RELAT!$B17)))","v":""},{"$f":"IF(AA$14=0,\"\",IF(AA$31<>\"avaliacao\",\"Não se aplica\",COUNTIF(PESQ!AA$14:AA$113,RELAT!$B17)))","v":""},{"$f":"IF(AB$14=0,\"\",IF(AB$31<>\"avaliacao\",\"Não se aplica\",COUNTIF(PESQ!AB$14:AB$113,RELAT!$B17)))","v":""}]
[null,"Bom",{"$f":"IF(C$14=0,\"\",IF(C$31<>\"avaliacao\",\"Não se aplica\",COUNTIF(PESQ!C$14:C$113,RELAT!$B18)))","v":"Não se aplica"},{"$f":"IF(D$14=0,\"\",IF(D$31<>\"avaliacao\",\"Não se aplica\",COUNTIF(PESQ!D$14:D$113,RELAT!$B18)))","v":1},{"$f":"IF(E$14=0,\"\",IF(E$31<>\"avaliacao\",\"Não se aplica\",COUNTIF(PESQ!E$14:E$113,RELAT!$B18)))","v":"Não se aplica"},{"$f":"IF(F$14=0,\"\",IF(F$31<>\"avaliacao\",\"Não se aplica\",COUNTIF(PESQ!F$14:F$113,RELAT!$B18)))","v":"Não se aplica"},{"$f":"IF(G$14=0,\"\",IF(G$31<>\"avaliacao\",\"Não se aplica\",COUNTIF(PESQ!G$14:G$113,RELAT!$B18)))","v":"Não se aplica"},{"$f":"IF(H$14=0,\"\",IF(H$31<>\"avaliacao\",\"Não se aplica\",COUNTIF(PESQ!H$14:H$113,RELAT!$B18)))","v":2},{"$f":"IF(I$14=0,\"\",IF(I$31<>\"avaliacao\",\"Não se aplica\",COUNTIF(PESQ!I$14:I$113,RELAT!$B18)))","v":""},{"$f":"IF(J$14=0,\"\",IF(J$31<>\"avaliacao\",\"Não se aplica\",COUNTIF(PESQ!J$14:J$113,RELAT!$B18)))","v":""},{"$f":"IF(K$14=0,\"\",IF(K$31<>\"avaliacao\",\"Não se aplica\",COUNTIF(PESQ!K$14:K$113,RELAT!$B18)))","v":""},{"$f":"IF(L$14=0,\"\",IF(L$31<>\"avaliacao\",\"Não se aplica\",COUNTIF(PESQ!L$14:L$113,RELAT!$B18)))","v":""},{"$f":"IF(M$14=0,\"\",IF(M$31<>\"avaliacao\",\"Não se aplica\",COUNTIF(PESQ!M$14:M$113,RELAT!$B18)))","v":""},{"$f":"IF(N$14=0,\"\",IF(N$31<>\"avaliacao\",\"Não se aplica\",COUNTIF(PESQ!N$14:N$113,RELAT!$B18)))","v":""},{"$f":"IF(O$14=0,\"\",IF(O$31<>\"avaliacao\",\"Não se aplica\",COUNTIF(PESQ!O$14:O$113,RELAT!$B18)))","v":""},{"$f":"IF(P$14=0,\"\",IF(P$31<>\"avaliacao\",\"Não se aplica\",COUNTIF(PESQ!P$14:P$113,RELAT!$B18)))","v":""},{"$f":"IF(Q$14=0,\"\",IF(Q$31<>\"avaliacao\",\"Não se aplica\",COUNTIF(PESQ!Q$14:Q$113,RELAT!$B18)))","v":""},{"$f":"IF(R$14=0,\"\",IF(R$31<>\"avaliacao\",\"Não se aplica\",COUNTIF(PESQ!R$14:R$113,RELAT!$B18)))","v":""},{"$f":"IF(S$14=0,\"\",IF(S$31<>\"avaliacao\",\"Não se aplica\",COUNTIF(PESQ!S$14:S$113,RELAT!$B18)))","v":""},{"$f":"IF(T$14=0,\"\",IF(T$31<>\"avaliacao\",\"Não se aplica\",COUNTIF(PESQ!T$14:T$113,RELAT!$B18)))","v":""},{"$f":"IF(U$14=0,\"\",IF(U$31<>\"avaliacao\",\"Não se aplica\",COUNTIF(PESQ!U$14:U$113,RELAT!$B18)))","v":""},{"$f":"IF(V$14=0,\"\",IF(V$31<>\"avaliacao\",\"Não se aplica\",COUNTIF(PESQ!V$14:V$113,RELAT!$B18)))","v":""},{"$f":"IF(W$14=0,\"\",IF(W$31<>\"avaliacao\",\"Não se aplica\",COUNTIF(PESQ!W$14:W$113,RELAT!$B18)))","v":""},{"$f":"IF(X$14=0,\"\",IF(X$31<>\"avaliacao\",\"Não se aplica\",COUNTIF(PESQ!X$14:X$113,RELAT!$B18)))","v":""},{"$f":"IF(Y$14=0,\"\",IF(Y$31<>\"avaliacao\",\"Não se aplica\",COUNTIF(PESQ!Y$14:Y$113,RELAT!$B18)))","v":""},{"$f":"IF(Z$14=0,\"\",IF(Z$31<>\"avaliacao\",\"Não se aplica\",COUNTIF(PESQ!Z$14:Z$113,RELAT!$B18)))","v":""},{"$f":"IF(AA$14=0,\"\",IF(AA$31<>\"avaliacao\",\"Não se aplica\",COUNTIF(PESQ!AA$14:AA$113,RELAT!$B18)))","v":""},{"$f":"IF(AB$14=0,\"\",IF(AB$31<>\"avaliacao\",\"Não se aplica\",COUNTIF(PESQ!AB$14:AB$113,RELAT!$B18)))","v":""}]
{"$rows_left_out":14}
{"sheet":"PESQ","index":4,"n_rows":132,"n_cols":28,"rows_kept":132,"merged":[[10,1,10,2],[11,1,12,1],[11,2,12,2],[11,3,12,3],[11,4,12,4],[11,5,12,5],[11,6,12,6],[11,7,12,7],[11,8,12,8],[11,9,12,9],[11,10,12,10],[11,11,12,11],[11,12,12,12],[11,13,12,13],[11,14,12,14],[11,15,12,15],[11,16,12,16],[11,17,12,17],[11,18,12,18],[11,19,12,19],[11,20,12,20],[11,21,12,21],[11,22,12,22],[11,23,12,23],[11,24,12,24],[11,25,12,25],[11,26,12,26],[11,27,12,27],[11,28,12,28],[11,29,12,29],[11,30,12,30],[11,31,12,31],[11,32,12,32],[11,33,12,33],[11,34,12,34],[11,35,12,35],[11,36,12,36],[11,37,12,37],[11,38,12,38],[11,39,12,39],[11,40,12,40],[11,41,12,41],[11,42,12,42],[11,43,12,43],[11,44,12,44],[11,45,12,45],[11,46,12,46],[11,47,12,47],[11,48,12,48],[11,49,12,49],[11,50,12,50],[11,51,12,51]]}
{"$rows_empty":10}
[null,"Pesquisa de Mercado\nInsira as respostas para cada entrevistado."]
[null,"Entrevistado",{"$f":"RESP!$F$15","v":"Você já experimentou algum produto dessa marca?"},{"$f":"RESP!$F$16","v":"O que achou da embalagem do produto?"},{"$f":"RESP!$F$17","v":"Você conhece a Marca X"},{"$f":"RESP!$F$18","v":"Você usaria esse produto no seu dia-a-dia?"},{"$f":"RESP!$F$19","v":"Esse produto atende as suas necessidades?"},{"$f":"RESP!$F$20","v":"O que achou do preço do produto?"},{"$f":"RESP!$F$21","v":0},{"$f":"RESP!$F$22","v":0},{"$f":"RESP!$F$23","v":0},{"$f":"RESP!$F$24","v":0},{"$f":"RESP!$F$25","v":0},{"$f":"RESP!$F$26","v":0},{"$f":"RESP!$F$27","v":0},{"$f":"RESP!$F$28","v":0},{"$f":"RESP!$F$29","v":0},{"$f":"RESP!$F$30","v":0},{"$f":"RESP!$F$31","v":0},{"$f":"RESP!$F$32","v":0},{"$f":"RESP!$F$33","v":0},{"$f":"RESP!$F$34","v":0},{"$f":"RESP!$F$35","v":0},{"$f":"RESP!$F$36","v":0},{"$f":"RESP!$F$37","v":0},{"$f":"RESP!$F$38","v":0},{"$f":"RESP!$F$39","v":0},{"$f":"RESP!$F$40","v":0}]
[]
[null,{"$f":"IF(PERFIL!D15=\"\",\"\",PERFIL!D15)","v":"Entrevistado 1"},"Sim","Excelente",2,"Não","Não","Bom"]
[null,{"$f":"IF(PERFIL!D16=\"\",\"\",PERFIL!D16)","v":"Entrevistado 2"},"Não","Bom",4,"Sim","Sim","Péssimo"]
[null,{"$f":"IF(PERFIL!D17=\"\",\"\",PERFIL!D17)","v":"Entrevistado 3"},"Sim","Ruim",5,"Não","Não","Ruim"]
[null,{"$f":"IF(PERFIL!D18=\"\",\"\",PERFIL!D18)","v":"Entrevistado 4"},"Não","Péssimo",8,"Sim","Não","Bom"]
{"$rows_left_out":116}
{"sheet":"Dash","index":5,"n_rows":0,"n_cols":0,"rows_kept":0}

{"sheet":"Dash (2)","index":6,"n_rows":13,"n_cols":4,"rows_kept":13,"merged":[[12,3,12,20]]}
{"$rows_empty":12}
[{"$nulls":3},"O que achou da embalagem do produto?"]

{"sheet":"Instruções","index":7,"n_rows":0,"n_cols":0,"rows_kept":0}

{"sheet":"calc","index":8,"n_rows":18,"n_cols":11,"rows_kept":18}
[{"$f":"RESP!B15","v":"Sim"},{"$f":"COUNTIF(PESQ!$C$14:$AB$113,calc!A1)","v":7},null,"Selecionado:",{"$f":"'Dash (2)'!D13","v":"O que achou da embalagem do produto?"}]
[{"$f":"RESP!B16","v":"Não"},{"$f":"COUNTIF(PESQ!$C$14:$AB$113,calc!A2)","v":8},null,"Tipo de Resposta:",{"$f":"VLOOKUP(E1,RESP!$F$15:$G$114,2,0)","v":"Avaliação"}]
[]
[{"$f":"RESP!C15","v":"Excelente"},{"$f":"COUNTIF(PESQ!$C$14:$AB$113,calc!A4)","v":3},null,{"$f":"IF($E$2=\"Binária\",$A$1,IF($E$2=\"Avaliação\",$A$4,IF($E$2=\"Qualitativa\",$A$9,\"\")))","v":"Excelente"},{"$f":"IFERROR(HLOOKUP($E$1,PESQ!C$12:AB$132,F4,0),\"\")","v":2},{"$f":"IF($E$2=\"Binária\",104,IF($E$2=\"Avaliação\",107,IF($E$2=\"Qualitativa\",112,\"\")))","v":107},null,null,{"$f":"D4","v":"Excelente"},{"$f":"IFERROR(E4/$K$4,\"\")","v":{"v":0.4,"d":"40%"}},{"$f":"SUM(E4:E13)","v":5}]
[{"$f":"RESP!C16","v":"Bom"},{"$f":"COUNTIF(PESQ!$C$14:$AB$113,calc!A5)","v":3},null,{"$f":"IF($E$2=\"Binária\",A2,IF($E$2=\"Avaliação\",A5,IF($E$2=\"Qualitativa\",A10,\"\")))","v":"Bom"},{"$f":"IFERROR(HLOOKUP($E$1,PESQ!C$12:AB$132,F5,0),\"\")","v":1},{"$f":"IF(D5=\"\",\"\",F4+1)","v":108},null,null,{"$f":"D5","v":"Bom"},{"$f":"IFERROR(E5/$K$4,\"\")","v":{"v":0.2,"d":"20%"}}]
[{"$f":"RESP!C17","v":"Ruim"},{"$f":"COUNTIF(PESQ!$C$14:$AB$113,calc!A6)","v":2},null,{"$f":"IF($E$2=\"Avaliação\",A6,IF($E$2=\"Qualitativa\",A11,\"\"))","v":"Ruim"},{"$f":"IFERROR(HLOOKUP($E$1,PESQ!C$12:AB$132,F6,0),\"\")","v":1},{"$f":"IF(D6=\"\",\"\",F5+1)","v":109},null,null,"Ruim",{"v":0.2,"d":"20%"}]
[{"$f":"RESP!C18","v":"Péssimo"},{"$f":"COUNTIF(PESQ!$C$14:$AB$113,calc!A7)","v":2},null,{"$f":"IF($E$2=\"Avaliação\",A7,IF($E$2=\"Qualitativa\",A12,\"\"))","v":"Péssimo"},{"$f":"IFERROR(HLOOKUP($E$1,PESQ!C$12:AB$132,F7,0),\"\")","v":1},110,null,null,"Péssimo",{"v":0.2,"d":"20%"}]
[{"$nulls":3},{"$f":"IF($E$2=\"Qualitativa\",A13,\"\")","v":""},{"$f":"IFERROR(HLOOKUP($E$1,PESQ!C$12:AB$132,F8,0),\"\")","v":""},"",null,null,"",""]
{"$rows_left_out":10}