{"text_format":"3","workbook":"xlsx","n_sheets":9,"sheets":["Menu","PERFIL","RESP","RELAT","PESQ","Dash","Dash (2)","Instruções","calc"],"not_rendered":{"charts":5,"images":9,"macros":1,"defined_names":14},"read":"whole","date_system":"1900"}

{"sheet":"Menu","index":0,"n_rows":0,"n_cols":0,"rows_kept":0}

{"sheet":"PERFIL","index":1,"n_rows":115,"n_cols":8,"rows_kept":115,"merged":[[8,4,9,4],[11,3,11,7],[12,1,13,1],[12,3,13,3],[12,4,13,4],[12,5,13,5],[12,6,13,6],[12,7,13,7]]}
{"$rows_empty":11}
[null,"Cadastro de Perfil\nInsira os perfis que melhor representa seu público-alvo.",null,"Cadastro de Entrevistados\nInsira as informações dos entrevistados."]
[null,"Perfil",null,"Entrevistado","Perfil do Entrevistado","Telefone","E-mail","Idade"]
[]
[null,"Perfil 1",null,"Entrevistado 1","Perfil 1","9999-9999","entrevistado1@123.com.br",35]
[null,"Perfil 2",null,"Entrevistado 2","Perfil 1","8888-8888","entrevistado2@123.com.br",28]
[null,"Perfil 3",null,"Entrevistado 3","Perfil 2","7777-7777","entrevistado3@123.com.br",22]
[null,"Perfil 4",null,"Entrevistado 4","Perfil 3","6666-6666","entrevistado4@123.com.br",29]
[null,"Perfil 5",null,"Entrevistado 5","Perfil 5","5555-5555","entrevistado5@123.com.br",32]
[null,"Perfil 6"]
[null,"Perfil 7"]
[null,"Perfil 8"]
[null,"Perfil 9"]
[null,"Perfil 10"]
{"$rows_empty":90}
[{"$nulls":3},{"$f":"COUNTA(D15:D114)","v":5}]

{"sheet":"RESP","index":2,"n_rows":41,"n_cols":7,"rows_kept":41,"merged":[[11,1,11,3],[11,5,11,6],[12,1,13,1],[12,2,13,2],[12,3,13,3],[12,5,13,5],[12,6,13,6]]}
{"$rows_empty":11}
[null,"Tipo de Resposta\nInsira as configurações do tipo de resposta.",{"$nulls":3},"Cadastro de Perguntas\nInsira as perguntas relevantes para seu público-alvo."]
[null,"Binária","Avaliação","Qualitativa",null,"Pergunta","Tipo de Resposta"]
[]
[null,"Sim","Excelente",1,null,"Você já experimentou algum produto dessa marca?","Binária"]
[null,"Não","Bom",2,null,"O que achou da embalagem do produto?","Avaliação"]
[null,null,"Ruim",3,null,"Você conhece a Marca X","Qualitativa"]
[null,null,"Péssimo",4,null,"Você usaria esse produto no seu dia-a-dia?","Binária"]
[{"$nulls":3},5,null,"Esse produto atende as suas necessidades?","Binária"]
[{"$nulls":3},6,null,"O que achou do preço do produto?","Avaliação"]
[{"$nulls":3},7]
[{"$nulls":3},8]
[{"$nulls":3},9]
[{"$nulls":3},10]
{"$rows_empty":16}
[{"$nulls":5},{"$f":"COUNTA(F15:F40)","v":6}]

{"sheet":"RELAT","index":3,"n_rows":31,"n_cols":28,"rows_kept":31,"merged":[[11,1,12,1],[11,2,12,2],[11,3,12,3],[11,4,12,4],[11,5,12,5],[11,6,12,6],[11,7,12,7],[11,8,12,8],[11,9,12,9],[11,10,12,10],[11,11,12,11],[11,12,12,12],[11,13,12,13],[11,14,12,14],[11,15,12,15],[11,16,12,16],[11,17,12,17],[11,18,12,18],[11,19,12,19],[11,20,12,20],[11,21,12,21],[11,22,12,22],[11,23,12,23],[11,24,12,24],[11,25,12,25],[11,26,12,26],[11,27,12,27],[11,28,12,28],[11,29,12,29],[11,30,12,30],[11,31,12,31],[11,32,12,32],[11,33,12,33],[11,34,12,34],[11,35,12,35],[11,36,12,36],[11,37,12,37],[11,38,12,38],[11,39,12,39],[11,40,12,40],[11,41,12,41],[11,42,12,42],[11,43,12,43],[11,44,12,44],[11,45,12,45],[11,46,12,46],[11,47,12,47],[11,48,12,48],[11,49,12,49],[11,50,12,50],[11,51,12,51]]}
{"$rows_empty":11}
[null,"Perguntas",{"$f":"RESP!$F$15","v":"Você já experimentou algum produto dessa marca?"},{"$f":"RESP!$F$16","v":"O que achou da embalagem do produto?"},{"$f":"RESP!$F$17","v":"Você conhece a Marca X"},{"$f":"RESP!$F$18","v":"Você usaria esse produto no seu dia-a-dia?"},{"$f":"RESP!$F$19","v":"Esse produto atende as suas necessidades?"},{"$f":"RESP!$F$20","v":"O que achou do preço do produto?"},{"$f":"RESP!$F$21","v":0},{"$f":"RESP!$F$22","v":0},{"$f":"RESP!$F$23","v":0},{"$f":"RESP!$F$24","v":0},{"$f":"RESP!$F$25","v":0},{"$f":"RESP!$F$26","v":0},{"$f":"RESP!$F$27","v":0},{"$f":"RESP!$F$28","v":0},{"$f":"RESP!$F$29","v":0},{"$f":"RESP!$F$30","v":0},{"$f":"RESP!$F$31","v":0},{"$f":"RESP!$F$32","v":0},{"$f":"RESP!$F$33","v":0},{"$f":"RESP!$F$34","v":0},{"$f":"RESP!$F$35","v":0},{"$f":"RESP!$F$36","v":0},{"$f":"RESP!$F$37","v":0},{"$f":"RESP!$F$38","v":0},{"$f":"RESP!$F$39","v":0},{"$f":"RESP!$F$40","v":0}]
[]
[null,"Total de Respostas",{"$f":"COUNTA(PESQ!C14:C113)","v":5},{"$f":"COUNTA(PESQ!D14:D113)","v":5},{"$f":"COUNTA(PESQ!E14:E113)","v":5},{"$f":"COUNTA(PESQ!F14:F113)","v":5},{"$f":"COUNTA(PESQ!G14:G113)","v":5},{"$f":"COUNTA(PESQ!H14:H113)","v":5},{"$f":"COUNTA(PESQ!I14:I113)","v":0},{"$f":"COUNTA(PESQ!J14:J113)","v":0},{"$f":"COUNTA(PESQ!K14:K113)","v":0},{"$f":"COUNTA(PESQ!L14:L113)","v":0},{"$f":"COUNTA(PESQ!M14:M113)","v":0},{"$f":"COUNTA(PESQ!N14:N113)","v":0},{"$f":"COUNTA(PESQ!O14:O113)","v":0},{"$f":"COUNTA(PESQ!P14:P113)","v":0},{"$f":"COUNTA(PESQ!Q14:Q113)","v":0},{"$f":"COUNTA(PESQ!R14:R113)","v":0},{"$f":"COUNTA(PESQ!S14:S113)","v":0},{"$f":"COUNTA(PESQ!T14:T113)","v":0},{"$f":"COUNTA(PESQ!U14:U113)","v":0},{"$f":"COUNTA(PESQ!V14:V113)","v":0},{"$f":"COUNTA(PESQ!W14:W113)","v":0},{"$f":"COUNTA(PESQ!X14:X113)","v":0},{"$f":"COUNTA(PESQ!Y14:Y113)","v":0},{"$f":"COUNTA(PESQ!Z14:Z113)","v":0},{"$f":"COUNTA(PESQ!AA14:AA113)","v":0},{"$f":"COUNTA(PESQ!AB14:AB113)","v":0}]
[null,"Sim",{"$f":"IF(C$14=0,\"\",IF(C$31<>\"bin\",\"Não se aplica\",COUNTIF(PESQ!C$14:C$113,RELAT!$B15)))","v":2},{"$f":"IF(D$14=0,\"\",IF(D$31<>\"bin\",\"Não se aplica\",COUNTIF(PESQ!D$14:D$113,RELAT!$B15)))","v":"Não se aplica"},{"$f":"IF(E$14=0,\"\",IF(E$31<>\"bin\",\"Não se aplica\",COUNTIF(PESQ!E$14:E$113,RELAT!$B15)))","v":"Não se aplica"},{"$f":"IF(F$14=0,\"\",IF(F$31<>\"bin\",\"Não se aplica\",COUNTIF(PESQ!F$14:F$113,RELAT!$B15)))","v":3},{"$f":"IF(G$14=0,\"\",IF(G$31<>\"bin\",\"Não se aplica\",COUNTIF(PESQ!G$14:G$113,RELAT!$B15)))","v":2},{"$f":"IF(H$14=0,\"\",IF(H$31<>\"bin\",\"Não se aplica\",COUNTIF(PESQ!H$14:H$113,RELAT!$B15)))","v":"Não se aplica"},{"$f":"IF(I$14=0,\"\",IF(I$31<>\"bin\",\"Não se aplica\",COUNTIF(PESQ!I$14:I$113,RELAT!$B15)))","v":""},{"$f":"IF(J$14=0,\"\",IF(J$31<>\"bin\",\"Não se aplica\",COUNTIF(PESQ!J$14:J$113,RELAT!$B15)))","v":""},{"$f":"IF(K$14=0,\"\",IF(K$31<>\"bin\",\"Não se aplica\",COUNTIF(PESQ!K$14:K$113,RELAT!$B15)))","v":""},{"$f":"IF(L$14=0,\"\",IF(L$31<>\"bin\",\"Não se aplica\",COUNTIF(PESQ!L$14:L$113,RELAT!$B15)))","v":""},{"$f":"IF(M$14=0,\"\",IF(M$31<>\"bin\",\"Não se aplica\",COUNTIF(PESQ!M$14:M$113,RELAT!$B15)))","v":""},{"$f":"IF(N$14=0,\"\",IF(N$31<>\"bin\",\"Não se aplica\",COUNTIF(PESQ!N$14:N$113,RELAT!$B15)))","v":""},{"$f":"IF(O$14=0,\"\",IF(O$31<>\"bin\",\"Não se aplica\",COUNTIF(PESQ!O$14:O$113,RELAT!$B15)))","v":""},{"$f":"IF(P$14=0,\"\",IF(P$31<>\"bin\",\"Não se aplica\",COUNTIF(PESQ!P$14:P$113,RELAT!$B15)))","v":""},{"$f":"IF(Q$14=0,\"\",IF(Q$31<>\"bin\",\"Não se aplica\",COUNTIF(PESQ!Q$14:Q$113,RELAT!$B15)))","v":""},{"$f":"IF(R$14=0,\"\",IF(R$31<>\"bin\",\"Não se aplica\",COUNTIF(PESQ!R$14:R$113,RELAT!$B15)))","v":""},{"$f":"IF(S$14=0,\"\",IF(S$31<>\"bin\",\"Não se aplica\",COUNTIF(PESQ!S$14:S$113,RELAT!$B15)))","v":""},{"$f":"IF(T$14=0,\"\",IF(T$31<>\"bin\",\"Não se aplica\",COUNTIF(PESQ!T$14:T$113,RELAT!$B15)))","v":""},{"$f":"IF(U$14=0,\"\",IF(U$31<>\"bin\",\"Não se aplica\",COUNTIF(PESQ!U$14:U$113,RELAT!$B15)))","v":""},{"$f":"IF(V$14=0,\"\",IF(V$31<>\"bin\",\"Não se aplica\",COUNTIF(PESQ!V$14:V$113,RELAT!$B15)))","v":""},{"$f":"IF(W$14=0,\"\",IF(W$31<>\"bin\",\"Não se aplica\",COUNTIF(PESQ!W$14:W$113,RELAT!$B15)))","v":""},{"$f":"IF(X$14=0,\"\",IF(X$31<>\"bin\",\"Não se aplica\",COUNTIF(PESQ!X$14:X$113,RELAT!$B15)))","v":""},{"$f":"IF(Y$14=0,\"\",IF(Y$31<>\"bin\",\"Não se aplica\",COUNTIF(PESQ!Y$14:Y$113,RELAT!$B15)))","v":""},{"$f":"IF(Z$14=0,\"\",IF(Z$31<>\"bin\",\"Não se aplica\",COUNTIF(PESQ!Z$14:Z$113,RELAT!$B15)))","v":""},{"$f":"IF(AA$14=0,\"\",IF(AA$31<>\"bin\",\"Não se aplica\",COUNTIF(PESQ!AA$14:AA$113,RELAT!$B15)))","v":""},{"$f":"IF(AB$14=0,\"\",IF(AB$31<>\"bin\",\"Não se aplica\",COUNTIF(PESQ!AB$14:AB$113,RELAT!$B15)))","v":""}]
[null,"Não",{"$f":"IF(C$14=0,\"\",IF(C$31<>\"bin\",\"Não se aplica\",COUNTIF(PESQ!C$14:C$113,RELAT!$B16)))","v":3},{"$f":"IF(D$14=0,\"\",IF(D$31<>\"bin\",\"Não se aplica\",COUNTIF(PESQ!D$14:D$113,RELAT!$B16)))","v":"Não se aplica"},{"$f":"IF(E$14=0,\"\",IF(E$31<>\"bin\",\"Não se aplica\",COUNTIF(PESQ!E$14:E$113,RELAT!$B16)))","v":"Não se aplica"},{"$f":"IF(F$14=0,\"\",IF(F$31<>\"bin\",\"Não se aplica\",COUNTIF(PESQ!F$14:F$113,RELAT!$B16)))","v":2},{"$f":"IF(G$14=0,\"\",IF(G$31<>\"bin\",\"Não se aplica\",COUNTIF(PESQ!G$14:G$113,RELAT!$B16)))","v":3},{"$f":"IF(H$14=0,\"\",IF(H$31<>\"bin\",\"Não se aplica\",COUNTIF(PESQ!H$14:H$113,RELAT!$B16)))","v":"Não se aplica"},{"$f":"IF(I$14=0,\"\",IF(I$31<>\"bin\",\"Não se aplica\",COUNTIF(PESQ!I$14:I$113,RELAT!$B16)))","v":""},{"$f":"IF(J$14=0,\"\",IF(J$31<>\"bin\",\"Não se aplica\",COUNTIF(PESQ!J$14:J$113,RELAT!$B16)))","v":""},{"$f":"IF(K$14=0,\"\",IF(K$31<>\"bin\",\"Não se aplica\",COUNTIF(PESQ!K$14:K$113,RELAT!$B16)))","v":""},{"$f":"IF(L$14=0,\"\",IF(L$31<>\"bin\",\"Não se aplica\",COUNTIF(PESQ!L$14:L$113,RELAT!$B16)))","v":""},{"$f":"IF(M$14=0,\"\",IF(M$31<>\"bin\",\"Não se aplica\",COUNTIF(PESQ!M$14:M$113,RELAT!$B16)))","v":""},{"$f":"IF(N$14=0,\"\",IF(N$31<>\"bin\",\"Não se aplica\",COUNTIF(PESQ!N$14:N$113,RELAT!$B16)))","v":""},{"$f":"IF(O$14=0,\"\",IF(O$31<>\"bin\",\"Não se aplica\",COUNTIF(PESQ!O$14:O$113,RELAT!$B16)))","v":""},{"$f":"IF(P$14=0,\"\",IF(P$31<>\"bin\",\"Não se aplica\",COUNTIF(PESQ!P$14:P$113,RELAT!$B16)))","v":""},{"$f":"IF(Q$14=0,\"\",IF(Q$31<>\"bin\",\"Não se aplica\",COUNTIF(PESQ!Q$14:Q$113,RELAT!$B16)))","v":""},{"$f":"IF(R$14=0,\"\",IF(R$31<>\"bin\",\"Não se aplica\",COUNTIF(PESQ!R$14:R$113,RELAT!$B16)))","v":""},{"$f":"IF(S$14=0,\"\",IF(S$31<>\"bin\",\"Não se aplica\",COUNTIF(PESQ!S$14:S$113,RELAT!$B16)))","v":""},{"$f":"IF(T$14=0,\"\",IF(T$31<>\"bin\",\"Não se aplica\",COUNTIF(PESQ!T$14:T$113,RELAT!$B16)))","v":""},{"$f":"IF(U$14=0,\"\",IF(U$31<>\"bin\",\"Não se aplica\",COUNTIF(PESQ!U$14:U$113,RELAT!$B16)))","v":""},{"$f":"IF(V$14=0,\"\",IF(V$31<>\"bin\",\"Não se aplica\",COUNTIF(PESQ!V$14:V$113,RELAT!$B16)))","v":""},{"$f":"IF(W$14=0,\"\",IF(W$31<>\"bin\",\"Não se aplica\",COUNTIF(PESQ!W$14:W$113,RELAT!$B16)))","v":""},{"$f":"IF(X$14=0,\"\",IF(X$31<>\"bin\",\"Não se aplica\",COUNTIF(PESQ!X$14:X$113,RELAT!$B16)))","v":""},{"$f":"IF(Y$14=0,\"\",IF(Y$31<>\"bin\",\"Não se aplica\",COUNTIF(PESQ!Y$14:Y$113,RELAT!$B16)))","v":""},{"$f":"IF(Z$14=0,\"\",IF(Z$31<>\"bin\",\"Não se aplica\",COUNTIF(PESQ!Z$14:Z$113,RELAT!$B16)))","v":""},{"$f":"IF(AA$14=0,\"\",IF(AA$31<>\"bin\",\"Não se aplica\",COUNTIF(PESQ!AA$14:AA$113,RELAT!$B16)))","v":""},{"$f":"IF(AB$14=0,\"\",IF(AB$31<>\"bin\",\"Não se aplica\",COUNTIF(PESQ!AB$14:AB$113,RELAT!$B16)))","v":""}]
[null,"Excelente",{"$f":"IF(C$14=0,\"\",IF(C$31<>\"avaliacao\",\"Não se aplica\",COUNTIF(PESQ!C$14:C$113,RELAT!$B17)))","v":"Não se aplica"},{"$f":"IF(D$14=0,\"\",IF(D$31<>\"avaliacao\",\"Não se aplica\",COUNTIF(PESQ!D$14:D$113,RELAT!$B17)))","v":2},{"$f":"IF(E$14=0,\"\",IF(E$31<>\"avaliacao\",\"Não se aplica\",COUNTIF(PESQ!E$14:E$113,RELAT!$B17)))","v":"Não se aplica"},{"$f":"IF(F$14=0,\"\",IF(F$31<>\"avaliacao\",\"Não se aplica\",COUNTIF(PESQ!F$14:F$113,RELAT!$B17)))","v":"Não se aplica"},{"$f":"IF(G$14=0,\"\",IF(G$31<>\"avaliacao\",\"Não se aplica\",COUNTIF(PESQ!G$14:G$113,RELAT!$B17)))","v":"Não se aplica"},{"$f":"IF(H$14=0,\"\",IF(H$31<>\"avaliacao\",\"Não se aplica\",COUNTIF(PESQ!H$14:H$113,RELAT!$B17)))","v":1},{"$f":"IF(I$14=0,\"\",IF(I$31<>\"avaliacao\",\"Não se aplica\",COUNTIF(PESQ!I$14:I$113,RELAT!$B17)))","v":""},{"$f":"IF(J$14=0,\"\",IF(J$31<>\"avaliacao\",\"Não se aplica\",COUNTIF(PESQ!J$14:J$113,RELAT!$B17)))","v":""},{"$f":"IF(K$14=0,\"\",IF(K$31<>\"avaliacao\",\"Não se aplica\",COUNTIF(PESQ!K$14:K$113,RELAT!$B17)))","v":""},{"$f":"IF(L$14=0,\"\",IF(L$31<>\"avaliacao\",\"Não se aplica\",COUNTIF(PESQ!L$14:L$113,RELAT!$B17)))","v":""},{"$f":"IF(M$14=0,\"\",IF(M$31<>\"avaliacao\",\"Não se aplica\",COUNTIF(PESQ!M$14:M$113,RELAT!$B17)))","v":""},{"$f":"IF(N$14=0,\"\",IF(N$31<>\"avaliacao\",\"Não se aplica\",COUNTIF(PESQ!N$14:N$113,RELAT!$B17)))","v":""},{"$f":"IF(O$14=0,\"\",IF(O$31<>\"avaliacao\",\"Não se aplica\",COUNTIF(PESQ!O$14:O$113,RELAT!$B17)))","v":""},{"$f":"IF(P$14=0,\"\",IF(P$31<>\"avaliacao\",\"Não se aplica\",COUNTIF(PESQ!P$14:P$113,RELAT!$B17)))","v":""},{"$f":"IF(Q$14=0,\"\",IF(Q$31<>\"avaliacao\",\"Não se aplica\",COUNTIF(PESQ!Q$14:Q$113,RELAT!$B17)))","v":""},{"$f":"IF(R$14=0,\"\",IF(R$31<>\"avaliacao\",\"Não se aplica\",COUNTIF(PESQ!R$14:R$113,RELAT!$B17)))","v":""},{"$f":"IF(S$14=0,\"\",IF(S$31<>\"avaliacao\",\"Não se aplica\",COUNTIF(PESQ!S$14:S$113,RELAT!$B17)))","v":""},{"$f":"IF(T$14=0,\"\",IF(T$31<>\"avaliacao\",\"Não se aplica\",COUNTIF(PESQ!T$14:T$113,RELAT!$B17)))","v":""},{"$f":"IF(U$14=0,\"\",IF(U$31<>\"avaliacao\",\"Não se aplica\",COUNTIF(PESQ!U$14:U$113,RELAT!$B17)))","v":""},{"$f":"IF(V$14=0,\"\",IF(V$31<>\"avaliacao\",\"Não se aplica\",COUNTIF(PESQ!V$14:V$113,RELAT!$B17)))","v":""},{"$f":"IF(W$14=0,\"\",IF(W$31<>\"avaliacao\",\"Não se aplica\",COUNTIF(PESQ!W$14:W$113,RELAT!$B17)))","v":""},{"$f":"IF(X$14=0,\"\",IF(X$31<>\"avaliacao\",\"Não se aplica\",COUNTIF(PESQ!X$14:X$113,RELAT!$B17)))","v":""},{"$f":"IF(Y$14=0,\"\",IF(Y$31<>\"avaliacao\",\"Não se aplica\",COUNTIF(PESQ!Y$14:Y$113,RELAT!$B17)))","v":""},{"$f":"IF(Z$14=0,\"\",IF(Z$31<>\"avaliacao\",\"Não se aplica\",COUNTIF(PESQ!Z$14:Z$113,RELAT!$B17)))","v":""},{"$f":"IF(AA$14=0,\"\",IF(AA$31<>\"avaliacao\",\"Não se aplica\",COUNTIF(PESQ!AA$14:AA$113,RELAT!$B17)))","v":""},{"$f":"IF(AB$14=0,\"\",IF(AB$31<>\"avaliacao\",\"Não se aplica\",COUNTIF(PESQ!AB$14:AB$113,RELAT!$B17)))","v":""}]
[null,"Bom",{"$f":"IF(C$14=0,\"\",IF(C$31<>\"avaliacao\",\"Não se aplica\",COUNTIF(PESQ!C$14:C$113,RELAT!$B18)))","v":"Não se aplica"},{"$f":"IF(D$14=0,\"\",IF(D$31<>\"avaliacao\",\"Não se aplica\",COUNTIF(PESQ!D$14:D$113,RELAT!$B18)))","v":1},{"$f":"IF(E$14=0,\"\",IF(E$31<>\"avaliacao\",\"Não se aplica\",COUNTIF(PESQ!E$14:E$113,RELAT!$B18)))","v":"Não se aplica"},{"$f":"IF(F$14=0,\"\",IF(F$31<>\"avaliacao\",\"Não se aplica\",COUNTIF(PESQ!F$14:F$113,RELAT!$B18)))","v":"Não se aplica"},{"$f":"IF(G$14=0,\"\",IF(G$31<>\"avaliacao\",\"Não se aplica\",COUNTIF(PESQ!G$14:G$113,RELAT!$B18)))","v":"Não se aplica"},{"$f":"IF(H$14=0,\"\",IF(H$31<>\"avaliacao\",\"Não se aplica\",COUNTIF(PESQ!H$14:H$113,RELAT!$B18)))","v":2},{"$f":"IF(I$14=0,\"\",IF(I$31<>\"avaliacao\",\"Não se aplica\",COUNTIF(PESQ!I$14:I$113,RELAT!$B18)))","v":""},{"$f":"IF(J$14=0,\"\",IF(J$31<>\"avaliacao\",\"Não se aplica\",COUNTIF(PESQ!J$14:J$113,RELAT!$B18)))","v":""},{"$f":"IF(K$14=0,\"\",IF(K$31<>\"avaliacao\",\"Não se aplica\",COUNTIF(PESQ!K$14:K$113,RELAT!$B18)))","v":""},{"$f":"IF(L$14=0,\"\",IF(L$31<>\"avaliacao\",\"Não se aplica\",COUNTIF(PESQ!L$14:L$113,RELAT!$B18)))","v":""},{"$f":"IF(M$14=0,\"\",IF(M$31<>\"avaliacao\",\"Não se aplica\",COUNTIF(PESQ!M$14:M$113,RELAT!$B18)))","v":""},{"$f":"IF(N$14=0,\"\",IF(N$31<>\"avaliacao\",\"Não se aplica\",COUNTIF(PESQ!N$14:N$113,RELAT!$B18)))","v":""},{"$f":"IF(O$14=0,\"\",IF(O$31<>\"avaliacao\",\"Não se aplica\",COUNTIF(PESQ!O$14:O$113,RELAT!$B18)))","v":""},{"$f":"IF(P$14=0,\"\",IF(P$31<>\"avaliacao\",\"Não se aplica\",COUNTIF(PESQ!P$14:P$113,RELAT!$B18)))","v":""},{"$f":"IF(Q$14=0,\"\",IF(Q$31<>\"avaliacao\",\"Não se aplica\",COUNTIF(PESQ!Q$14:Q$113,RELAT!$B18)))","v":""},{"$f":"IF(R$14=0,\"\",IF(R$31<>\"avaliacao\",\"Não se aplica\",COUNTIF(PESQ!R$14:R$113,RELAT!$B18)))","v":""},{"$f":"IF(S$14=0,\"\",IF(S$31<>\"avaliacao\",\"Não se aplica\",COUNTIF(PESQ!S$14:S$113,RELAT!$B18)))","v":""},{"$f":"IF(T$14=0,\"\",IF(T$31<>\"avaliacao\",\"Não se aplica\",COUNTIF(PESQ!T$14:T$113,RELAT!$B18)))","v":""},{"$f":"IF(U$14=0,\"\",IF(U$31<>\"avaliacao\",\"Não se aplica\",COUNTIF(PESQ!U$14:U$113,RELAT!$B18)))","v":""},{"$f":"IF(V$14=0,\"\",IF(V$31<>\"avaliacao\",\"Não se aplica\",COUNTIF(PESQ!V$14:V$113,RELAT!$B18)))","v":""},{"$f":"IF(W$14=0,\"\",IF(W$31<>\"avaliacao\",\"Não se aplica\",COUNTIF(PESQ!W$14:W$113,RELAT!$B18)))","v":""},{"$f":"IF(X$14=0,\"\",IF(X$31<>\"avaliacao\",\"Não se aplica\",COUNTIF(PESQ!X$14:X$113,RELAT!$B18)))","v":""},{"$f":"IF(Y$14=0,\"\",IF(Y$31<>\"avaliacao\",\"Não se aplica\",COUNTIF(PESQ!Y$14:Y$113,RELAT!$B18)))","v":""},{"$f":"IF(Z$14=0,\"\",IF(Z$31<>\"avaliacao\",\"Não se aplica\",COUNTIF(PESQ!Z$14:Z$113,RELAT!$B18)))","v":""},{"$f":"IF(AA$14=0,\"\",IF(AA$31<>\"avaliacao\",\"Não se aplica\",COUNTIF(PESQ!AA$14:AA$113,RELAT!$B18)))","v":""},{"$f":"IF(AB$14=0,\"\",IF(AB$31<>\"avaliacao\",\"Não se aplica\",COUNTIF(PESQ!AB$14:AB$113,RELAT!$B18)))","v":""}]
[null,"Ruim",{"$f":"IF(C$14=0,\"\",IF(C$31<>\"avaliacao\",\"Não se aplica\",COUNTIF(PESQ!C$14:C$113,RELAT!$B19)))","v":"Não se aplica"},{"$f":"IF(D$14=0,\"\",IF(D$31<>\"avaliacao\",\"Não se aplica\",COUNTIF(PESQ!D$14:D$113,RELAT!$B19)))","v":1},{"$f":"IF(E$14=0,\"\",IF(E$31<>\"avaliacao\",\"Não se aplica\",COUNTIF(PESQ!E$14:E$113,RELAT!$B19)))","v":"Não se aplica"},{"$f":"IF(F$14=0,\"\",IF(F$31<>\"avaliacao\",\"Não se aplica\",COUNTIF(PESQ!F$14:F$113,RELAT!$B19)))","v":"Não se aplica"},{"$f":"IF(G$14=0,\"\",IF(G$31<>\"avaliacao\",\"Não se aplica\",COUNTIF(PESQ!G$14:G$113,RELAT!$B19)))","v":"Não se aplica"},{"$f":"IF(H$14=0,\"\",IF(H$31<>\"avaliacao\",\"Não se aplica\",COUNTIF(PESQ!H$14:H$113,RELAT!$B19)))","v":1},{"$f":"IF(I$14=0,\"\",IF(I$31<>\"avaliacao\",\"Não se aplica\",COUNTIF(PESQ!I$14:I$113,RELAT!$B19)))","v":""},{"$f":"IF(J$14=0,\"\",IF(J$31<>\"avaliacao\",\"Não se aplica\",COUNTIF(PESQ!J$14:J$113,RELAT!$B19)))","v":""},{"$f":"IF(K$14=0,\"\",IF(K$31<>\"avaliacao\",\"Não se aplica\",COUNTIF(PESQ!K$14:K$113,RELAT!$B19)))","v":""},{"$f":"IF(L$14=0,\"\",IF(L$31<>\"avaliacao\",\"Não se aplica\",COUNTIF(PESQ!L$14:L$113,RELAT!$B19)))","v":""},{"$f":"IF(M$14=0,\"\",IF(M$31<>\"avaliacao\",\"Não se aplica\",COUNTIF(PESQ!M$14:M$113,RELAT!$B19)))","v":""},{"$f":"IF(N$14=0,\"\",IF(N$31<>\"avaliacao\",\"Não se aplica\",COUNTIF(PESQ!N$14:N$113,RELAT!$B19)))","v":""},{"$f":"IF(O$14=0,\"\",IF(O$31<>\"avaliacao\",\"Não se aplica\",COUNTIF(PESQ!O$14:O$113,RELAT!$B19)))","v":""},{"$f":"IF(P$14=0,\"\",IF(P$31<>\"avaliacao\",\"Não se aplica\",COUNTIF(PESQ!P$14:P$113,RELAT!$B19)))","v":""},{"$f":"IF(Q$14=0,\"\",IF(Q$31<>\"avaliacao\",\"Não se aplica\",COUNTIF(PESQ!Q$14:Q$113,RELAT!$B19)))","v":""},{"$f":"IF(R$14=0,\"\",IF(R$31<>\"avaliacao\",\"Não se aplica\",COUNTIF(PESQ!R$14:R$113,RELAT!$B19)))","v":""},{"$f":"IF(S$14=0,\"\",IF(S$31<>\"avaliacao\",\"Não se aplica\",COUNTIF(PESQ!S$14:S$113,RELAT!$B19)))","v":""},{"$f":"IF(T$14=0,\"\",IF(T$31<>\"avaliacao\",\"Não se aplica\",COUNTIF(PESQ!T$14:T$113,RELAT!$B19)))","v":""},{"$f":"IF(U$14=0,\"\",IF(U$31<>\"avaliacao\",\"Não se aplica\",COUNTIF(PESQ!U$14:U$113,RELAT!$B19)))","v":""},{"$f":"IF(V$14=0,\"\",IF(V$31<>\"avaliacao\",\"Não se aplica\",COUNTIF(PESQ!V$14:V$113,RELAT!$B19)))","v":""},{"$f":"IF(W$14=0,\"\",IF(W$31<>\"avaliacao\",\"Não se aplica\",COUNTIF(PESQ!W$14:W$113,RELAT!$B19)))","v":""},{"$f":"IF(X$14=0,\"\",IF(X$31<>\"avaliacao\",\"Não se aplica\",COUNTIF(PESQ!X$14:X$113,RELAT!$B19)))","v":""},{"$f":"IF(Y$14=0,\"\",IF(Y$31<>\"avaliacao\",\"Não se aplica\",COUNTIF(PESQ!Y$14:Y$113,RELAT!$B19)))","v":""},{"$f":"IF(Z$14=0,\"\",IF(Z$31<>\"avaliacao\",\"Não se aplica\",COUNTIF(PESQ!Z$14:Z$113,RELAT!$B19)))","v":""},{"$f":"IF(AA$14=0,\"\",IF(AA$31<>\"avaliacao\",\"Não se aplica\",COUNTIF(PESQ!AA$14:AA$113,RELAT!$B19)))","v":""},{"$f":"IF(AB$14=0,\"\",IF(AB$31<>\"avaliacao\",\"Não se aplica\",COUNTIF(PESQ!AB$14:AB$113,RELAT!$B19)))","v":""}]
[null,"Péssimo",{"$f":"IF(C$14=0,\"\",IF(C$31<>\"avaliacao\",\"Não se aplica\",COUNTIF(PESQ!C$14:C$113,RELAT!$B20)))","v":"Não se aplica"},{"$f":"IF(D$14=0,\"\",IF(D$31<>\"avaliacao\",\"Não se aplica\",COUNTIF(PESQ!D$14:D$113,RELAT!$B20)))","v":1},{"$f":"IF(E$14=0,\"\",IF(E$31<>\"avaliacao\",\"Não se aplica\",COUNTIF(PESQ!E$14:E$113,RELAT!$B20)))","v":"Não se aplica"},{"$f":"IF(F$14=0,\"\",IF(F$31<>\"avaliacao\",\"Não se aplica\",COUNTIF(PESQ!F$14:F$113,RELAT!$B20)))","v":"Não se aplica"},{"$f":"IF(G$14=0,\"\",IF(G$31<>\"avaliacao\",\"Não se aplica\",COUNTIF(PESQ!G$14:G$113,RELAT!$B20)))","v":"Não se aplica"},{"$f":"IF(H$14=0,\"\",IF(H$31<>\"avaliacao\",\"Não se aplica\",COUNTIF(PESQ!H$14:H$113,RELAT!$B20)))","v":1},{"$f":"IF(I$14=0,\"\",IF(I$31<>\"avaliacao\",\"Não se aplica\",COUNTIF(PESQ!I$14:I$113,RELAT!$B20)))","v":""},{"$f":"IF(J$14=0,\"\",IF(J$31<>\"avaliacao\",\"Não se aplica\",COUNTIF(PESQ!J$14:J$113,RELAT!$B20)))","v":""},{"$f":"IF(K$14=0,\"\",IF(K$31<>\"avaliacao\",\"Não se aplica\",COUNTIF(PESQ!K$14:K$113,RELAT!$B20)))","v":""},{"$f":"IF(L$14=0,\"\",IF(L$31<>\"avaliacao\",\"Não se aplica\",COUNTIF(PESQ!L$14:L$113,RELAT!$B20)))","v":""},{"$f":"IF(M$14=0,\"\",IF(M$31<>\"avaliacao\",\"Não se aplica\",COUNTIF(PESQ!M$14:M$113,RELAT!$B20)))","v":""},{"$f":"IF(N$14=0,\"\",IF(N$31<>\"avaliacao\",\"Não se aplica\",COUNTIF(PESQ!N$14:N$113,RELAT!$B20)))","v":""},{"$f":"IF(O$14=0,\"\",IF(O$31<>\"avaliacao\",\"Não se aplica\",COUNTIF(PESQ!O$14:O$113,RELAT!$B20)))","v":""},{"$f":"IF(P$14=0,\"\",IF(P$31<>\"avaliacao\",\"Não se aplica\",COUNTIF(PESQ!P$14:P$113,RELAT!$B20)))","v":""},{"$f":"IF(Q$14=0,\"\",IF(Q$31<>\"avaliacao\",\"Não se aplica\",COUNTIF(PESQ!Q$14:Q$113,RELAT!$B20)))","v":""},{"$f":"IF(R$14=0,\"\",IF(R$31<>\"avaliacao\",\"Não se aplica\",COUNTIF(PESQ!R$14:R$113,RELAT!$B20)))","v":""},{"$f":"IF(S$14=0,\"\",IF(S$31<>\"avaliacao\",\"Não se aplica\",COUNTIF(PESQ!S$14:S$113,RELAT!$B20)))","v":""},{"$f":"IF(T$14=0,\"\",IF(T$31<>\"avaliacao\",\"Não se aplica\",COUNTIF(PESQ!T$14:T$113,RELAT!$B20)))","v":""},{"$f":"IF(U$14=0,\"\",IF(U$31<>\"avaliacao\",\"Não se aplica\",COUNTIF(PESQ!U$14:U$113,RELAT!$B20)))","v":""},{"$f":"IF(V$14=0,\"\",IF(V$31<>\"avaliacao\",\"Não se aplica\",COUNTIF(PESQ!V$14:V$113,RELAT!$B20)))","v":""},{"$f":"IF(W$14=0,\"\",IF(W$31<>\"avaliacao\",\"Não se aplica\",COUNTIF(PESQ!W$14:W$113,RELAT!$B20)))","v":""},{"$f":"IF(X$14=0,\"\",IF(X$31<>\"avaliacao\",\"Não se aplica\",COUNTIF(PESQ!X$14:X$113,RELAT!$B20)))","v":""},{"$f":"IF(Y$14=0,\"\",IF(Y$31<>\"avaliacao\",\"Não se aplica\",COUNTIF(PESQ!Y$14:Y$113,RELAT!$B20)))","v":""},{"$f":"IF(Z$14=0,\"\",IF(Z$31<>\"avaliacao\",\"Não se aplica\",COUNTIF(PESQ!Z$14:Z$113,RELAT!$B20)))","v":""},{"$f":"IF(AA$14=0,\"\",IF(AA$31<>\"avaliacao\",\"Não se aplica\",COUNTIF(PESQ!AA$14:AA$113,RELAT!$B20)))","v":""},{"$f":"IF(AB$14=0,\"\",IF(AB$31<>\"avaliacao\",\"Não se aplica\",COUNTIF(PESQ!AB$14:AB$113,RELAT!$B20)))","v":""}]
[null,1,{"$f":"IF(C$14=0,\"\",IF(C$31<>\"qualit\",\"Não se aplica\",COUNTIF(PESQ!C$14:C$113,RELAT!$B21)))","v":"Não se aplica"},{"$f":"IF(D$14=0,\"\",IF(D$31<>\"qualit\",\"Não se aplica\",COUNTIF(PESQ!D$14:D$113,RELAT!$B21)))","v":"Não se aplica"},{"$f":"IF(E$14=0,\"\",IF(E$31<>\"qualit\",\"Não se aplica\",COUNTIF(PESQ!E$14:E$113,RELAT!$B21)))","v":0},{"$f":"IF(F$14=0,\"\",IF(F$31<>\"qualit\",\"Não se aplica\",COUNTIF(PESQ!F$14:F$113,RELAT!$B21)))","v":"Não se aplica"},{"$f":"IF(G$14=0,\"\",IF(G$31<>\"qualit\",\"Não se aplica\",COUNTIF(PESQ!G$14:G$113,RELAT!$B21)))","v":"Não se aplica"},{"$f":"IF(H$14=0,\"\",IF(H$31<>\"qualit\",\"Não se aplica\",COUNTIF(PESQ!H$14:H$113,RELAT!$B21)))","v":"Não se aplica"},{"$f":"IF(I$14=0,\"\",IF(I$31<>\"qualit\",\"Não se aplica\",COUNTIF(PESQ!I$14:I$113,RELAT!$B21)))","v":""},{"$f":"IF(J$14=0,\"\",IF(J$31<>\"qualit\",\"Não se aplica\",COUNTIF(PESQ!J$14:J$113,RELAT!$B21)))","v":""},{"$f":"IF(K$14=0,\"\",IF(K$31<>\"qualit\",\"Não se aplica\",COUNTIF(PESQ!K$14:K$113,RELAT!$B21)))","v":""},{"$f":"IF(L$14=0,\"\",IF(L$31<>\"qualit\",\"Não se aplica\",COUNTIF(PESQ!L$14:L$113,RELAT!$B21)))","v":""},{"$f":"IF(M$14=0,\"\",IF(M$31<>\"qualit\",\"Não se aplica\",COUNTIF(PESQ!M$14:M$113,RELAT!$B21)))","v":""},{"$f":"IF(N$14=0,\"\",IF(N$31<>\"qualit\",\"Não se aplica\",COUNTIF(PESQ!N$14:N$113,RELAT!$B21)))","v":""},{"$f":"IF(O$14=0,\"\",IF(O$31<>\"qualit\",\"Não se aplica\",COUNTIF(PESQ!O$14:O$113,RELAT!$B21)))","v":""},{"$f":"IF(P$14=0,\"\",IF(P$31<>\"qualit\",\"Não se aplica\",COUNTIF(PESQ!P$14:P$113,RELAT!$B21)))","v":""},{"$f":"IF(Q$14=0,\"\",IF(Q$31<>\"qualit\",\"Não se aplica\",COUNTIF(PESQ!Q$14:Q$113,RELAT!$B21)))","v":""},{"$f":"IF(R$14=0,\"\",IF(R$31<>\"qualit\",\"Não se aplica\",COUNTIF(PESQ!R$14:R$113,RELAT!$B21)))","v":""},{"$f":"IF(S$14=0,\"\",IF(S$31<>\"qualit\",\"Não se aplica\",COUNTIF(PESQ!S$14:S$113,RELAT!$B21)))","v":""},{"$f":"IF(T$14=0,\"\",IF(T$31<>\"qualit\",\"Não se aplica\",COUNTIF(PESQ!T$14:T$113,RELAT!$B21)))","v":""},{"$f":"IF(U$14=0,\"\",IF(U$31<>\"qualit\",\"Não se aplica\",COUNTIF(PESQ!U$14:U$113,RELAT!$B21)))","v":""},{"$f":"IF(V$14=0,\"\",IF(V$31<>\"qualit\",\"Não se aplica\",COUNTIF(PESQ!V$14:V$113,RELAT!$B21)))","v":""},{"$f":"IF(W$14=0,\"\",IF(W$31<>\"qualit\",\"Não se aplica\",COUNTIF(PESQ!W$14:W$113,RELAT!$B21)))","v":""},{"$f":"IF(X$14=0,\"\",IF(X$31<>\"qualit\",\"Não se aplica\",COUNTIF(PESQ!X$14:X$113,RELAT!$B21)))","v":""},{"$f":"IF(Y$14=0,\"\",IF(Y$31<>\"qualit\",\"Não se aplica\",COUNTIF(PESQ!Y$14:Y$113,RELAT!$B21)))","v":""},{"$f":"IF(Z$14=0,\"\",IF(Z$31<>\"qualit\",\"Não se aplica\",COUNTIF(PESQ!Z$14:Z$113,RELAT!$B21)))","v":""},{"$f":"IF(AA$14=0,\"\",IF(AA$31<>\"qualit\",\"Não se aplica\",COUNTIF(PESQ!AA$14:AA$113,RELAT!$B21)))","v":""},{"$f":"IF(AB$14=0,\"\",IF(AB$31<>\"qualit\",\"Não se aplica\",COUNTIF(PESQ!AB$14:AB$113,RELAT!$B21)))","v":""}]
[null,2,{"$f":"IF(C$14=0,\"\",IF(C$31<>\"qualit\",\"Não se aplica\",COUNTIF(PESQ!C$14:C$113,RELAT!$B22)))","v":"Não se aplica"},{"$f":"IF(D$14=0,\"\",IF(D$31<>\"qualit\",\"Não se aplica\",COUNTIF(PESQ!D$14:D$113,RELAT!$B22)))","v":"Não se aplica"},{"$f":"IF(E$14=0,\"\",IF(E$31<>\"qualit\",\"Não se aplica\",COUNTIF(PESQ!E$14:E$113,RELAT!$B22)))","v":1},{"$f":"IF(F$14=0,\"\",IF(F$31<>\"qualit\",\"Não se aplica\",COUNTIF(PESQ!F$14:F$113,RELAT!$B22)))","v":"Não se aplica"},{"$f":"IF(G$14=0,\"\",IF(G$31<>\"qualit\",\"Não se aplica\",COUNTIF(PESQ!G$14:G$113,RELAT!$B22)))","v":"Não se aplica"},{"$f":"IF(H$14=0,\"\",IF(H$31<>\"qualit\",\"Não se aplica\",COUNTIF(PESQ!H$14:H$113,RELAT!$B22)))","v":"Não se aplica"},{"$f":"IF(I$14=0,\"\",IF(I$31<>\"qualit\",\"Não se aplica\",COUNTIF(PESQ!I$14:I$113,RELAT!$B22)))","v":""},{"$f":"IF(J$14=0,\"\",IF(J$31<>\"qualit\",\"Não se aplica\",COUNTIF(PESQ!J$14:J$113,RELAT!$B22)))","v":""},{"$f":"IF(K$14=0,\"\",IF(K$31<>\"qualit\",\"Não se aplica\",COUNTIF(PESQ!K$14:K$113,RELAT!$B22)))","v":""},{"$f":"IF(L$14=0,\"\",IF(L$31<>\"qualit\",\"Não se aplica\",COUNTIF(PESQ!L$14:L$113,RELAT!$B22)))","v":""},{"$f":"IF(M$14=0,\"\",IF(M$31<>\"qualit\",\"Não se aplica\",COUNTIF(PESQ!M$14:M$113,RELAT!$B22)))","v":""},{"$f":"IF(N$14=0,\"\",IF(N$31<>\"qualit\",\"Não se aplica\",COUNTIF(PESQ!N$14:N$113,RELAT!$B22)))","v":""},{"$f":"IF(O$14=0,\"\",IF(O$31<>\"qualit\",\"Não se aplica\",COUNTIF(PESQ!O$14:O$113,RELAT!$B22)))","v":""},{"$f":"IF(P$14=0,\"\",IF(P$31<>\"qualit\",\"Não se aplica\",COUNTIF(PESQ!P$14:P$113,RELAT!$B22)))","v":""},{"$f":"IF(Q$14=0,\"\",IF(Q$31<>\"qualit\",\"Não se aplica\",COUNTIF(PESQ!Q$14:Q$113,RELAT!$B22)))","v":""},{"$f":"IF(R$14=0,\"\",IF(R$31<>\"qualit\",\"Não se aplica\",COUNTIF(PESQ!R$14:R$113,RELAT!$B22)))","v":""},{"$f":"IF(S$14=0,\"\",IF(S$31<>\"qualit\",\"Não se aplica\",COUNTIF(PESQ!S$14:S$113,RELAT!$B22)))","v":""},{"$f":"IF(T$14=0,\"\",IF(T$31<>\"qualit\",\"Não se aplica\",COUNTIF(PESQ!T$14:T$113,RELAT!$B22)))","v":""},{"$f":"IF(U$14=0,\"\",IF(U$31<>\"qualit\",\"Não se aplica\",COUNTIF(PESQ!U$14:U$113,RELAT!$B22)))","v":""},{"$f":"IF(V$14=0,\"\",IF(V$31<>\"qualit\",\"Não se aplica\",COUNTIF(PESQ!V$14:V$113,RELAT!$B22)))","v":""},{"$f":"IF(W$14=0,\"\",IF(W$31<>\"qualit\",\"Não se aplica\",COUNTIF(PESQ!W$14:W$113,RELAT!$B22)))","v":""},{"$f":"IF(X$14=0,\"\",IF(X$31<>\"qualit\",\"Não se aplica\",COUNTIF(PESQ!X$14:X$113,RELAT!$B22)))","v":""},{"$f":"IF(Y$14=0,\"\",IF(Y$31<>\"qualit\",\"Não se aplica\",COUNTIF(PESQ!Y$14:Y$113,RELAT!$B22)))","v":""},{"$f":"IF(Z$14=0,\"\",IF(Z$31<>\"qualit\",\"Não se aplica\",COUNTIF(PESQ!Z$14:Z$113,RELAT!$B22)))","v":""},{"$f":"IF(AA$14=0,\"\",IF(AA$31<>\"qualit\",\"Não se aplica\",COUNTIF(PESQ!AA$14:AA$113,RELAT!$B22)))","v":""},{"$f":"IF(AB$14=0,\"\",IF(AB$31<>\"qualit\",\"Não se aplica\",COUNTIF(PESQ!AB$14:AB$113,RELAT!$B22)))","v":""}]
[null,3,{"$f":"IF(C$14=0,\"\",IF(C$31<>\"qualit\",\"Não se aplica\",COUNTIF(PESQ!C$14:C$113,RELAT!$B23)))","v":"Não se aplica"},{"$f":"IF(D$14=0,\"\",IF(D$31<>\"qualit\",\"Não se aplica\",COUNTIF(PESQ!D$14:D$113,RELAT!$B23)))","v":"Não se aplica"},{"$f":"IF(E$14=0,\"\",IF(E$31<>\"qualit\",\"Não se aplica\",COUNTIF(PESQ!E$14:E$113,RELAT!$B23)))","v":0},{"$f":"IF(F$14=0,\"\",IF(F$31<>\"qualit\",\"Não se aplica\",COUNTIF(PESQ!F$14:F$113,RELAT!$B23)))","v":"Não se aplica"},{"$f":"IF(G$14=0,\"\",IF(G$31<>\"qualit\",\"Não se aplica\",COUNTIF(PESQ!G$14:G$113,RELAT!$B23)))","v":"Não se aplica"},{"$f":"IF(H$14=0,\"\",IF(H$31<>\"qualit\",\"Não se aplica\",COUNTIF(PESQ!H$14:H$113,RELAT!$B23)))","v":"Não se aplica"},{"$f":"IF(I$14=0,\"\",IF(I$31<>\"qualit\",\"Não se aplica\",COUNTIF(PESQ!I$14:I$113,RELAT!$B23)))","v":""},{"$f":"IF(J$14=0,\"\",IF(J$31<>\"qualit\",\"Não se aplica\",COUNTIF(PESQ!J$14:J$113,RELAT!$B23)))","v":""},{"$f":"IF(K$14=0,\"\",IF(K$31<>\"qualit\",\"Não se aplica\",COUNTIF(PESQ!K$14:K$113,RELAT!$B23)))","v":""},{"$f":"IF(L$14=0,\"\",IF(L$31<>\"qualit\",\"Não se aplica\",COUNTIF(PESQ!L$14:L$113,RELAT!$B23)))","v":""},{"$f":"IF(M$14=0,\"\",IF(M$31<>\"qualit\",\"Não se aplica\",COUNTIF(PESQ!M$14:M$113,RELAT!$B23)))","v":""},{"$f":"IF(N$14=0,\"\",IF(N$31<>\"qualit\",\"Não se aplica\",COUNTIF(PESQ!N$14:N$113,RELAT!$B23)))","v":""},{"$f":"IF(O$14=0,\"\",IF(O$31<>\"qualit\",\"Não se aplica\",COUNTIF(PESQ!O$14:O$113,RELAT!$B23)))","v":""},{"$f":"IF(P$14=0,\"\",IF(P$31<>\"qualit\",\"Não se aplica\",COUNTIF(PESQ!P$14:P$113,RELAT!$B23)))","v":""},{"$f":"IF(Q$14=0,\"\",IF(Q$31<>\"qualit\",\"Não se aplica\",COUNTIF(PESQ!Q$14:Q$113,RELAT!$B23)))","v":""},{"$f":"IF(R$14=0,\"\",IF(R$31<>\"qualit\",\"Não se aplica\",COUNTIF(PESQ!R$14:R$113,RELAT!$B23)))","v":""},{"$f":"IF(S$14=0,\"\",IF(S$31<>\"qualit\",\"Não se aplica\",COUNTIF(PESQ!S$14:S$113,RELAT!$B23)))","v":""},{"$f":"IF(T$14=0,\"\",IF(T$31<>\"qualit\",\"Não se aplica\",COUNTIF(PESQ!T$14:T$113,RELAT!$B23)))","v":""},{"$f":"IF(U$14=0,\"\",IF(U$31<>\"qualit\",\"Não se aplica\",COUNTIF(PESQ!U$14:U$113,RELAT!$B23)))","v":""},{"$f":"IF(V$14=0,\"\",IF(V$31<>\"qualit\",\"Não se aplica\",COUNTIF(PESQ!V$14:V$113,RELAT!$B23)))","v":""},{"$f":"IF(W$14=0,\"\",IF(W$31<>\"qualit\",\"Não se aplica\",COUNTIF(PESQ!W$14:W$113,RELAT!$B23)))","v":""},{"$f":"IF(X$14=0,\"\",IF(X$31<>\"qualit\",\"Não se aplica\",COUNTIF(PESQ!X$14:X$113,RELAT!$B23)))","v":""},{"$f":"IF(Y$14=0,\"\",IF(Y$31<>\"qualit\",\"Não se aplica\",COUNTIF(PESQ!Y$14:Y$113,RELAT!$B23)))","v":""},{"$f":"IF(Z$14=0,\"\",IF(Z$31<>\"qualit\",\"Não se aplica\",COUNTIF(PESQ!Z$14:Z$113,RELAT!$B23)))","v":""},{"$f":"IF(AA$14=0,\"\",IF(AA$31<>\"qualit\",\"Não se aplica\",COUNTIF(PESQ!AA$14:AA$113,RELAT!$B23)))","v":""},{"$f":"IF(AB$14=0,\"\",IF(AB$31<>\"qualit\",\"Não se aplica\",COUNTIF(PESQ!AB$14:AB$113,RELAT!$B23)))","v":""}]
[null,4,{"$f":"IF(C$14=0,\"\",IF(C$31<>\"qualit\",\"Não se aplica\",COUNTIF(PESQ!C$14:C$113,RELAT!$B24)))","v":"Não se aplica"},{"$f":"IF(D$14=0,\"\",IF(D$31<>\"qualit\",\"Não se aplica\",COUNTIF(PESQ!D$14:D$113,RELAT!$B24)))","v":"Não se aplica"},{"$f":"IF(E$14=0,\"\",IF(E$31<>\"qualit\",\"Não se aplica\",COUNTIF(PESQ!E$14:E$113,RELAT!$B24)))","v":1},{"$f":"IF(F$14=0,\"\",IF(F$31<>\"qualit\",\"Não se aplica\",COUNTIF(PESQ!F$14:F$113,RELAT!$B24)))","v":"Não se aplica"},{"$f":"IF(G$14=0,\"\",IF(G$31<>\"qualit\",\"Não se aplica\",COUNTIF(PESQ!G$14:G$113,RELAT!$B24)))","v":"Não se aplica"},{"$f":"IF(H$14=0,\"\",IF(H$31<>\"qualit\",\"Não se aplica\",COUNTIF(PESQ!H$14:H$113,RELAT!$B24)))","v":"Não se aplica"},{"$f":"IF(I$14=0,\"\",IF(I$31<>\"qualit\",\"Não se aplica\",COUNTIF(PESQ!I$14:I$113,RELAT!$B24)))","v":""},{"$f":"IF(J$14=0,\"\",IF(J$31<>\"qualit\",\"Não se aplica\",COUNTIF(PESQ!J$14:J$113,RELAT!$B24)))","v":""},{"$f":"IF(K$14=0,\"\",IF(K$31<>\"qualit\",\"Não se aplica\",COUNTIF(PESQ!K$14:K$113,RELAT!$B24)))","v":""},{"$f":"IF(L$14=0,\"\",IF(L$31<>\"qualit\",\"Não se aplica\",COUNTIF(PESQ!L$14:L$113,RELAT!$B24)))","v":""},{"$f":"IF(M$14=0,\"\",IF(M$31<>\"qualit\",\"Não se aplica\",COUNTIF(PESQ!M$14:M$113,RELAT!$B24)))","v":""},{"$f":"IF(N$14=0,\"\",IF(N$31<>\"qualit\",\"Não se aplica\",COUNTIF(PESQ!N$14:N$113,RELAT!$B24)))","v":""},{"$f":"IF(O$14=0,\"\",IF(O$31<>\"qualit\",\"Não se aplica\",COUNTIF(PESQ!O$14:O$113,RELAT!$B24)))","v":""},{"$f":"IF(P$14=0,\"\",IF(P$31<>\"qualit\",\"Não se aplica\",COUNTIF(PESQ!P$14:P$113,RELAT!$B24)))","v":""},{"$f":"IF(Q$14=0,\"\",IF(Q$31<>\"qualit\",\"Não se aplica\",COUNTIF(PESQ!Q$14:Q$113,RELAT!$B24)))","v":""},{"$f":"IF(R$14=0,\"\",IF(R$31<>\"qualit\",\"Não se aplica\",COUNTIF(PESQ!R$14:R$113,RELAT!$B24)))","v":""},{"$f":"IF(S$14=0,\"\",IF(S$31<>\"qualit\",\"Não se aplica\",COUNTIF(PESQ!S$14:S$113,RELAT!$B24)))","v":""},{"$f":"IF(T$14=0,\"\",IF(T$31<>\"qualit\",\"Não se aplica\",COUNTIF(PESQ!T$14:T$113,RELAT!$B24)))","v":""},{"$f":"IF(U$14=0,\"\",IF(U$31<>\"qualit\",\"Não se aplica\",COUNTIF(PESQ!U$14:U$113,RELAT!$B24)))","v":""},{"$f":"IF(V$14=0,\"\",IF(V$31<>\"qualit\",\"Não se aplica\",COUNTIF(PESQ!V$14:V$113,RELAT!$B24)))","v":""},{"$f":"IF(W$14=0,\"\",IF(W$31<>\"qualit\",\"Não se aplica\",COUNTIF(PESQ!W$14:W$113,RELAT!$B24)))","v":""},{"$f":"IF(X$14=0,\"\",IF(X$31<>\"qualit\",\"Não se aplica\",COUNTIF(PESQ!X$14:X$113,RELAT!$B24)))","v":""},{"$f":"IF(Y$14=0,\"\",IF(Y$31<>\"qualit\",\"Não se aplica\",COUNTIF(PESQ!Y$14:Y$113,RELAT!$B24)))","v":""},{"$f":"IF(Z$14=0,\"\",IF(Z$31<>\"qualit\",\"Não se aplica\",COUNTIF(PESQ!Z$14:Z$113,RELAT!$B24)))","v":""},{"$f":"IF(AA$14=0,\"\",IF(AA$31<>\"qualit\",\"Não se aplica\",COUNTIF(PESQ!AA$14:AA$113,RELAT!$B24)))","v":""},{"$f":"IF(AB$14=0,\"\",IF(AB$31<>\"qualit\",\"Não se aplica\",COUNTIF(PESQ!AB$14:AB$113,RELAT!$B24)))","v":""}]
[null,5,{"$f":"IF(C$14=0,\"\",IF(C$31<>\"qualit\",\"Não se aplica\",COUNTIF(PESQ!C$14:C$113,RELAT!$B25)))","v":"Não se aplica"},{"$f":"IF(D$14=0,\"\",IF(D$31<>\"qualit\",\"Não se aplica\",COUNTIF(PESQ!D$14:D$113,RELAT!$B25)))","v":"Não se aplica"},{"$f":"IF(E$14=0,\"\",IF(E$31<>\"qualit\",\"Não se aplica\",COUNTIF(PESQ!E$14:E$113,RELAT!$B25)))","v":1},{"$f":"IF(F$14=0,\"\",IF(F$31<>\"qualit\",\"Não se aplica\",COUNTIF(PESQ!F$14:F$113,RELAT!$B25)))","v":"Não se aplica"},{"$f":"IF(G$14=0,\"\",IF(G$31<>\"qualit\",\"Não se aplica\",COUNTIF(PESQ!G$14:G$113,RELAT!$B25)))","v":"Não se aplica"},{"$f":"IF(H$14=0,\"\",IF(H$31<>\"qualit\",\"Não se aplica\",COUNTIF(PESQ!H$14:H$113,RELAT!$B25)))","v":"Não se aplica"},{"$f":"IF(I$14=0,\"\",IF(I$31<>\"qualit\",\"Não se aplica\",COUNTIF(PESQ!I$14:I$113,RELAT!$B25)))","v":""},{"$f":"IF(J$14=0,\"\",IF(J$31<>\"qualit\",\"Não se aplica\",COUNTIF(PESQ!J$14:J$113,RELAT!$B25)))","v":""},{"$f":"IF(K$14=0,\"\",IF(K$31<>\"qualit\",\"Não se aplica\",COUNTIF(PESQ!K$14:K$113,RELAT!$B25)))","v":""},{"$f":"IF(L$14=0,\"\",IF(L$31<>\"qualit\",\"Não se aplica\",COUNTIF(PESQ!L$14:L$113,RELAT!$B25)))","v":""},{"$f":"IF(M$14=0,\"\",IF(M$31<>\"qualit\",\"Não se aplica\",COUNTIF(PESQ!M$14:M$113,RELAT!$B25)))","v":""},{"$f":"IF(N$14=0,\"\",IF(N$31<>\"qualit\",\"Não se aplica\",COUNTIF(PESQ!N$14:N$113,RELAT!$B25)))","v":""},{"$f":"IF(O$14=0,\"\",IF(O$31<>\"qualit\",\"Não se aplica\",COUNTIF(PESQ!O$14:O$113,RELAT!$B25)))","v":""},{"$f":"IF(P$14=0,\"\",IF(P$31<>\"qualit\",\"Não se aplica\",COUNTIF(PESQ!P$14:P$113,RELAT!$B25)))","v":""},{"$f":"IF(Q$14=0,\"\",IF(Q$31<>\"qualit\",\"Não se aplica\",COUNTIF(PESQ!Q$14:Q$113,RELAT!$B25)))","v":""},{"$f":"IF(R$14=0,\"\",IF(R$31<>\"qualit\",\"Não se aplica\",COUNTIF(PESQ!R$14:R$113,RELAT!$B25)))","v":""},{"$f":"IF(S$14=0,\"\",IF(S$31<>\"qualit\",\"Não se aplica\",COUNTIF(PESQ!S$14:S$113,RELAT!$B25)))","v":""},{"$f":"IF(T$14=0,\"\",IF(T$31<>\"qualit\",\"Não se aplica\",COUNTIF(PESQ!T$14:T$113,RELAT!$B25)))","v":""},{"$f":"IF(U$14=0,\"\",IF(U$31<>\"qualit\",\"Não se aplica\",COUNTIF(PESQ!U$14:U$113,RELAT!$B25)))","v":""},{"$f":"IF(V$14=0,\"\",IF(V$31<>\"qualit\",\"Não se aplica\",COUNTIF(PESQ!V$14:V$113,RELAT!$B25)))","v":""},{"$f":"IF(W$14=0,\"\",IF(W$31<>\"qualit\",\"Não se aplica\",COUNTIF(PESQ!W$14:W$113,RELAT!$B25)))","v":""},{"$f":"IF(X$14=0,\"\",IF(X$31<>\"qualit\",\"Não se aplica\",COUNTIF(PESQ!X$14:X$113,RELAT!$B25)))","v":""},{"$f":"IF(Y$14=0,\"\",IF(Y$31<>\"qualit\",\"Não se aplica\",COUNTIF(PESQ!Y$14:Y$113,RELAT!$B25)))","v":""},{"$f":"IF(Z$14=0,\"\",IF(Z$31<>\"qualit\",\"Não se aplica\",COUNTIF(PESQ!Z$14:Z$113,RELAT!$B25)))","v":""},{"$f":"IF(AA$14=0,\"\",IF(AA$31<>\"qualit\",\"Não se aplica\",COUNTIF(PESQ!AA$14:AA$113,RELAT!$B25)))","v":""},{"$f":"IF(AB$14=0,\"\",IF(AB$31<>\"qualit\",\"Não se aplica\",COUNTIF(PESQ!AB$14:AB$113,RELAT!$B25)))","v":""}]
[null,6,{"$f":"IF(C$14=0,\"\",IF(C$31<>\"qualit\",\"Não se aplica\",COUNTIF(PESQ!C$14:C$113,RELAT!$B26)))","v":"Não se aplica"},{"$f":"IF(D$14=0,\"\",IF(D$31<>\"qualit\",\"Não se aplica\",COUNTIF(PESQ!D$14:D$113,RELAT!$B26)))","v":"Não se aplica"},{"$f":"IF(E$14=0,\"\",IF(E$31<>\"qualit\",\"Não se aplica\",COUNTIF(PESQ!E$14:E$113,RELAT!$B26)))","v":0},{"$f":"IF(F$14=0,\"\",IF(F$31<>\"qualit\",\"Não se aplica\",COUNTIF(PESQ!F$14:F$113,RELAT!$B26)))","v":"Não se aplica"},{"$f":"IF(G$14=0,\"\",IF(G$31<>\"qualit\",\"Não se aplica\",COUNTIF(PESQ!G$14:G$113,RELAT!$B26)))","v":"Não se aplica"},{"$f":"IF(H$14=0,\"\",IF(H$31<>\"qualit\",\"Não se aplica\",COUNTIF(PESQ!H$14:H$113,RELAT!$B26)))","v":"Não se aplica"},{"$f":"IF(I$14=0,\"\",IF(I$31<>\"qualit\",\"Não se aplica\",COUNTIF(PESQ!I$14:I$113,RELAT!$B26)))","v":""},{"$f":"IF(J$14=0,\"\",IF(J$31<>\"qualit\",\"Não se aplica\",COUNTIF(PESQ!J$14:J$113,RELAT!$B26)))","v":""},{"$f":"IF(K$14=0,\"\",IF(K$31<>\"qualit\",\"Não se aplica\",COUNTIF(PESQ!K$14:K$113,RELAT!$B26)))","v":""},{"$f":"IF(L$14=0,\"\",IF(L$31<>\"qualit\",\"Não se aplica\",COUNTIF(PESQ!L$14:L$113,RELAT!$B26)))","v":""},{"$f":"IF(M$14=0,\"\",IF(M$31<>\"qualit\",\"Não se aplica\",COUNTIF(PESQ!M$14:M$113,RELAT!$B26)))","v":""},{"$f":"IF(N$14=0,\"\",IF(N$31<>\"qualit\",\"Não se aplica\",COUNTIF(PESQ!N$14:N$113,RELAT!$B26)))","v":""},{"$f":"IF(O$14=0,\"\",IF(O$31<>\"qualit\",\"Não se aplica\",COUNTIF(PESQ!O$14:O$113,RELAT!$B26)))","v":""},{"$f":"IF(P$14=0,\"\",IF(P$31<>\"qualit\",\"Não se aplica\",COUNTIF(PESQ!P$14:P$113,RELAT!$B26)))","v":""},{"$f":"IF(Q$14=0,\"\",IF(Q$31<>\"qualit\",\"Não se aplica\",COUNTIF(PESQ!Q$14:Q$113,RELAT!$B26)))","v":""},{"$f":"IF(R$14=0,\"\",IF(R$31<>\"qualit\",\"Não se aplica\",COUNTIF(PESQ!R$14:R$113,RELAT!$B26)))","v":""},{"$f":"IF(S$14=0,\"\",IF(S$31<>\"qualit\",\"Não se aplica\",COUNTIF(PESQ!S$14:S$113,RELAT!$B26)))","v":""},{"$f":"IF(T$14=0,\"\",IF(T$31<>\"qualit\",\"Não se aplica\",COUNTIF(PESQ!T$14:T$113,RELAT!$B26)))","v":""},{"$f":"IF(U$14=0,\"\",IF(U$31<>\"qualit\",\"Não se aplica\",COUNTIF(PESQ!U$14:U$113,RELAT!$B26)))","v":""},{"$f":"IF(V$14=0,\"\",IF(V$31<>\"qualit\",\"Não se aplica\",COUNTIF(PESQ!V$14:V$113,RELAT!$B26)))","v":""},{"$f":"IF(W$14=0,\"\",IF(W$31<>\"qualit\",\"Não se aplica\",COUNTIF(PESQ!W$14:W$113,RELAT!$B26)))","v":""},{"$f":"IF(X$14=0,\"\",IF(X$31<>\"qualit\",\"Não se aplica\",COUNTIF(PESQ!X$14:X$113,RELAT!$B26)))","v":""},{"$f":"IF(Y$14=0,\"\",IF(Y$31<>\"qualit\",\"Não se aplica\",COUNTIF(PESQ!Y$14:Y$113,RELAT!$B26)))","v":""},{"$f":"IF(Z$14=0,\"\",IF(Z$31<>\"qualit\",\"Não se aplica\",COUNTIF(PESQ!Z$14:Z$113,RELAT!$B26)))","v":""},{"$f":"IF(AA$14=0,\"\",IF(AA$31<>\"qualit\",\"Não se aplica\",COUNTIF(PESQ!AA$14:AA$113,RELAT!$B26)))","v":""},{"$f":"IF(AB$14=0,\"\",IF(AB$31<>\"qualit\",\"Não se aplica\",COUNTIF(PESQ!AB$14:AB$113,RELAT!$B26)))","v":""}]
[null,7,{"$f":"IF(C$14=0,\"\",IF(C$31<>\"qualit\",\"Não se aplica\",COUNTIF(PESQ!C$14:C$113,RELAT!$B27)))","v":"Não se aplica"},{"$f":"IF(D$14=0,\"\",IF(D$31<>\"qualit\",\"Não se aplica\",COUNTIF(PESQ!D$14:D$113,RELAT!$B27)))","v":"Não se aplica"},{"$f":"IF(E$14=0,\"\",IF(E$31<>\"qualit\",\"Não se aplica\",COUNTIF(PESQ!E$14:E$113,RELAT!$B27)))","v":0},{"$f":"IF(F$14=0,\"\",IF(F$31<>\"qualit\",\"Não se aplica\",COUNTIF(PESQ!F$14:F$113,RELAT!$B27)))","v":"Não se aplica"},{"$f":"IF(G$14=0,\"\",IF(G$31<>\"qualit\",\"Não se aplica\",COUNTIF(PESQ!G$14:G$113,RELAT!$B27)))","v":"Não se aplica"},{"$f":"IF(H$14=0,\"\",IF(H$31<>\"qualit\",\"Não se aplica\",COUNTIF(PESQ!H$14:H$113,RELAT!$B27)))","v":"Não se aplica"},{"$f":"IF(I$14=0,\"\",IF(I$31<>\"qualit\",\"Não se aplica\",COUNTIF(PESQ!I$14:I$113,RELAT!$B27)))","v":""},{"$f":"IF(J$14=0,\"\",IF(J$31<>\"qualit\",\"Não se aplica\",COUNTIF(PESQ!J$14:J$113,RELAT!$B27)))","v":""},{"$f":"IF(K$14=0,\"\",IF(K$31<>\"qualit\",\"Não se aplica\",COUNTIF(PESQ!K$14:K$113,RELAT!$B27)))","v":""},{"$f":"IF(L$14=0,\"\",IF(L$31<>\"qualit\",\"Não se aplica\",COUNTIF(PESQ!L$14:L$113,RELAT!$B27)))","v":""},{"$f":"IF(M$14=0,\"\",IF(M$31<>\"qualit\",\"Não se aplica\",COUNTIF(PESQ!M$14:M$113,RELAT!$B27)))","v":""},{"$f":"IF(N$14=0,\"\",IF(N$31<>\"qualit\",\"Não se aplica\",COUNTIF(PESQ!N$14:N$113,RELAT!$B27)))","v":""},{"$f":"IF(O$14=0,\"\",IF(O$31<>\"qualit\",\"Não se aplica\",COUNTIF(PESQ!O$14:O$113,RELAT!$B27)))","v":""},{"$f":"IF(P$14=0,\"\",IF(P$31<>\"qualit\",\"Não se aplica\",COUNTIF(PESQ!P$14:P$113,RELAT!$B27)))","v":""},{"$f":"IF(Q$14=0,\"\",IF(Q$31<>\"qualit\",\"Não se aplica\",COUNTIF(PESQ!Q$14:Q$113,RELAT!$B27)))","v":""},{"$f":"IF(R$14=0,\"\",IF(R$31<>\"qualit\",\"Não se aplica\",COUNTIF(PESQ!R$14:R$113,RELAT!$B27)))","v":""},{"$f":"IF(S$14=0,\"\",IF(S$31<>\"qualit\",\"Não se aplica\",COUNTIF(PESQ!S$14:S$113,RELAT!$B27)))","v":""},{"$f":"IF(T$14=0,\"\",IF(T$31<>\"qualit\",\"Não se aplica\",COUNTIF(PESQ!T$14:T$113,RELAT!$B27)))","v":""},{"$f":"IF(U$14=0,\"\",IF(U$31<>\"qualit\",\"Não se aplica\",COUNTIF(PESQ!U$14:U$113,RELAT!$B27)))","v":""},{"$f":"IF(V$14=0,\"\",IF(V$31<>\"qualit\",\"Não se aplica\",COUNTIF(PESQ!V$14:V$113,RELAT!$B27)))","v":""},{"$f":"IF(W$14=0,\"\",IF(W$31<>\"qualit\",\"Não se aplica\",COUNTIF(PESQ!W$14:W$113,RELAT!$B27)))","v":""},{"$f":"IF(X$14=0,\"\",IF(X$31<>\"qualit\",\"Não se aplica\",COUNTIF(PESQ!X$14:X$113,RELAT!$B27)))","v":""},{"$f":"IF(Y$14=0,\"\",IF(Y$31<>\"qualit\",\"Não se aplica\",COUNTIF(PESQ!Y$14:Y$113,RELAT!$B27)))","v":""},{"$f":"IF(Z$14=0,\"\",IF(Z$31<>\"qualit\",\"Não se aplica\",COUNTIF(PESQ!Z$14:Z$113,RELAT!$B27)))","v":""},{"$f":"IF(AA$14=0,\"\",IF(AA$31<>\"qualit\",\"Não se aplica\",COUNTIF(PESQ!AA$14:AA$113,RELAT!$B27)))","v":""},{"$f":"IF(AB$14=0,\"\",IF(AB$31<>\"qualit\",\"Não se aplica\",COUNTIF(PESQ!AB$14:AB$113,RELAT!$B27)))","v":""}]
[null,8,{"$f":"IF(C$14=0,\"\",IF(C$31<>\"qualit\",\"Não se aplica\",COUNTIF(PESQ!C$14:C$113,RELAT!$B28)))","v":"Não se aplica"},{"$f":"IF(D$14=0,\"\",IF(D$31<>\"qualit\",\"Não se aplica\",COUNTIF(PESQ!D$14:D$113,RELAT!$B28)))","v":"Não se aplica"},{"$f":"IF(E$14=0,\"\",IF(E$31<>\"qualit\",\"Não se aplica\",COUNTIF(PESQ!E$14:E$113,RELAT!$B28)))","v":1},{"$f":"IF(F$14=0,\"\",IF(F$31<>\"qualit\",\"Não se aplica\",COUNTIF(PESQ!F$14:F$113,RELAT!$B28)))","v":"Não se aplica"},{"$f":"IF(G$14=0,\"\",IF(G$31<>\"qualit\",\"Não se aplica\",COUNTIF(PESQ!G$14:G$113,RELAT!$B28)))","v":"Não se aplica"},{"$f":"IF(H$14=0,\"\",IF(H$31<>\"qualit\",\"Não se aplica\",COUNTIF(PESQ!H$14:H$113,RELAT!$B28)))","v":"Não se aplica"},{"$f":"IF(I$14=0,\"\",IF(I$31<>\"qualit\",\"Não se aplica\",COUNTIF(PESQ!I$14:I$113,RELAT!$B28)))","v":""},{"$f":"IF(J$14=0,\"\",IF(J$31<>\"qualit\",\"Não se aplica\",COUNTIF(PESQ!J$14:J$113,RELAT!$B28)))","v":""},{"$f":"IF(K$14=0,\"\",IF(K$31<>\"qualit\",\"Não se aplica\",COUNTIF(PESQ!K$14:K$113,RELAT!$B28)))","v":""},{"$f":"IF(L$14=0,\"\",IF(L$31<>\"qualit\",\"Não se aplica\",COUNTIF(PESQ!L$14:L$113,RELAT!$B28)))","v":""},{"$f":"IF(M$14=0,\"\",IF(M$31<>\"qualit\",\"Não se aplica\",COUNTIF(PESQ!M$14:M$113,RELAT!$B28)))","v":""},{"$f":"IF(N$14=0,\"\",IF(N$31<>\"qualit\",\"Não se aplica\",COUNTIF(PESQ!N$14:N$113,RELAT!$B28)))","v":""},{"$f":"IF(O$14=0,\"\",IF(O$31<>\"qualit\",\"Não se aplica\",COUNTIF(PESQ!O$14:O$113,RELAT!$B28)))","v":""},{"$f":"IF(P$14=0,\"\",IF(P$31<>\"qualit\",\"Não se aplica\",COUNTIF(PESQ!P$14:P$113,RELAT!$B28)))","v":""},{"$f":"IF(Q$14=0,\"\",IF(Q$31<>\"qualit\",\"Não se aplica\",COUNTIF(PESQ!Q$14:Q$113,RELAT!$B28)))","v":""},{"$f":"IF(R$14=0,\"\",IF(R$31<>\"qualit\",\"Não se aplica\",COUNTIF(PESQ!R$14:R$113,RELAT!$B28)))","v":""},{"$f":"IF(S$14=0,\"\",IF(S$31<>\"qualit\",\"Não se aplica\",COUNTIF(PESQ!S$14:S$113,RELAT!$B28)))","v":""},{"$f":"IF(T$14=0,\"\",IF(T$31<>\"qualit\",\"Não se aplica\",COUNTIF(PESQ!T$14:T$113,RELAT!$B28)))","v":""},{"$f":"IF(U$14=0,\"\",IF(U$31<>\"qualit\",\"Não se aplica\",COUNTIF(PESQ!U$14:U$113,RELAT!$B28)))","v":""},{"$f":"IF(V$14=0,\"\",IF(V$31<>\"qualit\",\"Não se aplica\",COUNTIF(PESQ!V$14:V$113,RELAT!$B28)))","v":""},{"$f":"IF(W$14=0,\"\",IF(W$31<>\"qualit\",\"Não se aplica\",COUNTIF(PESQ!W$14:W$113,RELAT!$B28)))","v":""},{"$f":"IF(X$14=0,\"\",IF(X$31<>\"qualit\",\"Não se aplica\",COUNTIF(PESQ!X$14:X$113,RELAT!$B28)))","v":""},{"$f":"IF(Y$14=0,\"\",IF(Y$31<>\"qualit\",\"Não se aplica\",COUNTIF(PESQ!Y$14:Y$113,RELAT!$B28)))","v":""},{"$f":"IF(Z$14=0,\"\",IF(Z$31<>\"qualit\",\"Não se aplica\",COUNTIF(PESQ!Z$14:Z$113,RELAT!$B28)))","v":""},{"$f":"IF(AA$14=0,\"\",IF(AA$31<>\"qualit\",\"Não se aplica\",COUNTIF(PESQ!AA$14:AA$113,RELAT!$B28)))","v":""},{"$f":"IF(AB$14=0,\"\",IF(AB$31<>\"qualit\",\"Não se aplica\",COUNTIF(PESQ!AB$14:AB$113,RELAT!$B28)))","v":""}]
[null,9,{"$f":"IF(C$14=0,\"\",IF(C$31<>\"qualit\",\"Não se aplica\",COUNTIF(PESQ!C$14:C$113,RELAT!$B29)))","v":"Não se aplica"},{"$f":"IF(D$14=0,\"\",IF(D$31<>\"qualit\",\"Não se aplica\",COUNTIF(PESQ!D$14:D$113,RELAT!$B29)))","v":"Não se aplica"},{"$f":"IF(E$14=0,\"\",IF(E$31<>\"qualit\",\"Não se aplica\",COUNTIF(PESQ!E$14:E$113,RELAT!$B29)))","v":0},{"$f":"IF(F$14=0,\"\",IF(F$31<>\"qualit\",\"Não se aplica\",COUNTIF(PESQ!F$14:F$113,RELAT!$B29)))","v":"Não se aplica"},{"$f":"IF(G$14=0,\"\",IF(G$31<>\"qualit\",\"Não se aplica\",COUNTIF(PESQ!G$14:G$113,RELAT!$B29)))","v":"Não se aplica"},{"$f":"IF(H$14=0,\"\",IF(H$31<>\"qualit\",\"Não se aplica\",COUNTIF(PESQ!H$14:H$113,RELAT!$B29)))","v":"Não se aplica"},{"$f":"IF(I$14=0,\"\",IF(I$31<>\"qualit\",\"Não se aplica\",COUNTIF(PESQ!I$14:I$113,RELAT!$B29)))","v":""},{"$f":"IF(J$14=0,\"\",IF(J$31<>\"qualit\",\"Não se aplica\",COUNTIF(PESQ!J$14:J$113,RELAT!$B29)))","v":""},{"$f":"IF(K$14=0,\"\",IF(K$31<>\"qualit\",\"Não se aplica\",COUNTIF(PESQ!K$14:K$113,RELAT!$B29)))","v":""},{"$f":"IF(L$14=0,\"\",IF(L$31<>\"qualit\",\"Não se aplica\",COUNTIF(PESQ!L$14:L$113,RELAT!$B29)))","v":""},{"$f":"IF(M$14=0,\"\",IF(M$31<>\"qualit\",\"Não se aplica\",COUNTIF(PESQ!M$14:M$113,RELAT!$B29)))","v":""},{"$f":"IF(N$14=0,\"\",IF(N$31<>\"qualit\",\"Não se aplica\",COUNTIF(PESQ!N$14:N$113,RELAT!$B29)))","v":""},{"$f":"IF(O$14=0,\"\",IF(O$31<>\"qualit\",\"Não se aplica\",COUNTIF(PESQ!O$14:O$113,RELAT!$B29)))","v":""},{"$f":"IF(P$14=0,\"\",IF(P$31<>\"qualit\",\"Não se aplica\",COUNTIF(PESQ!P$14:P$113,RELAT!$B29)))","v":""},{"$f":"IF(Q$14=0,\"\",IF(Q$31<>\"qualit\",\"Não se aplica\",COUNTIF(PESQ!Q$14:Q$113,RELAT!$B29)))","v":""},{"$f":"IF(R$14=0,\"\",IF(R$31<>\"qualit\",\"Não se aplica\",COUNTIF(PESQ!R$14:R$113,RELAT!$B29)))","v":""},{"$f":"IF(S$14=0,\"\",IF(S$31<>\"qualit\",\"Não se aplica\",COUNTIF(PESQ!S$14:S$113,RELAT!$B29)))","v":""},{"$f":"IF(T$14=0,\"\",IF(T$31<>\"qualit\",\"Não se aplica\",COUNTIF(PESQ!T$14:T$113,RELAT!$B29)))","v":""},{"$f":"IF(U$14=0,\"\",IF(U$31<>\"qualit\",\"Não se aplica\",COUNTIF(PESQ!U$14:U$113,RELAT!$B29)))","v":""},{"$f":"IF(V$14=0,\"\",IF(V$31<>\"qualit\",\"Não se aplica\",COUNTIF(PESQ!V$14:V$113,RELAT!$B29)))","v":""},{"$f":"IF(W$14=0,\"\",IF(W$31<>\"qualit\",\"Não se aplica\",COUNTIF(PESQ!W$14:W$113,RELAT!$B29)))","v":""},{"$f":"IF(X$14=0,\"\",IF(X$31<>\"qualit\",\"Não se aplica\",COUNTIF(PESQ!X$14:X$113,RELAT!$B29)))","v":""},{"$f":"IF(Y$14=0,\"\",IF(Y$31<>\"qualit\",\"Não se aplica\",COUNTIF(PESQ!Y$14:Y$113,RELAT!$B29)))","v":""},{"$f":"IF(Z$14=0,\"\",IF(Z$31<>\"qualit\",\"Não se aplica\",COUNTIF(PESQ!Z$14:Z$113,RELAT!$B29)))","v":""},{"$f":"IF(AA$14=0,\"\",IF(AA$31<>\"qualit\",\"Não se aplica\",COUNTIF(PESQ!AA$14:AA$113,RELAT!$B29)))","v":""},{"$f":"IF(AB$14=0,\"\",IF(AB$31<>\"qualit\",\"Não se aplica\",COUNTIF(PESQ!AB$14:AB$113,RELAT!$B29)))","v":""}]
[null,10,{"$f":"IF(C$14=0,\"\",IF(C$31<>\"qualit\",\"Não se aplica\",COUNTIF(PESQ!C$14:C$113,RELAT!$B30)))","v":"Não se aplica"},{"$f":"IF(D$14=0,\"\",IF(D$31<>\"qualit\",\"Não se aplica\",COUNTIF(PESQ!D$14:D$113,RELAT!$B30)))","v":"Não se aplica"},{"$f":"IF(E$14=0,\"\",IF(E$31<>\"qualit\",\"Não se aplica\",COUNTIF(PESQ!E$14:E$113,RELAT!$B30)))","v":1},{"$f":"IF(F$14=0,\"\",IF(F$31<>\"qualit\",\"Não se aplica\",COUNTIF(PESQ!F$14:F$113,RELAT!$B30)))","v":"Não se aplica"},{"$f":"IF(G$14=0,\"\",IF(G$31<>\"qualit\",\"Não se aplica\",COUNTIF(PESQ!G$14:G$113,RELAT!$B30)))","v":"Não se aplica"},{"$f":"IF(H$14=0,\"\",IF(H$31<>\"qualit\",\"Não se aplica\",COUNTIF(PESQ!H$14:H$113,RELAT!$B30)))","v":"Não se aplica"},{"$f":"IF(I$14=0,\"\",IF(I$31<>\"qualit\",\"Não se aplica\",COUNTIF(PESQ!I$14:I$113,RELAT!$B30)))","v":""},{"$f":"IF(J$14=0,\"\",IF(J$31<>\"qualit\",\"Não se aplica\",COUNTIF(PESQ!J$14:J$113,RELAT!$B30)))","v":""},{"$f":"IF(K$14=0,\"\",IF(K$31<>\"qualit\",\"Não se aplica\",COUNTIF(PESQ!K$14:K$113,RELAT!$B30)))","v":""},{"$f":"IF(L$14=0,\"\",IF(L$31<>\"qualit\",\"Não se aplica\",COUNTIF(PESQ!L$14:L$113,RELAT!$B30)))","v":""},{"$f":"IF(M$14=0,\"\",IF(M$31<>\"qualit\",\"Não se aplica\",COUNTIF(PESQ!M$14:M$113,RELAT!$B30)))","v":""},{"$f":"IF(N$14=0,\"\",IF(N$31<>\"qualit\",\"Não se aplica\",COUNTIF(PESQ!N$14:N$113,RELAT!$B30)))","v":""},{"$f":"IF(O$14=0,\"\",IF(O$31<>\"qualit\",\"Não se aplica\",COUNTIF(PESQ!O$14:O$113,RELAT!$B30)))","v":""},{"$f":"IF(P$14=0,\"\",IF(P$31<>\"qualit\",\"Não se aplica\",COUNTIF(PESQ!P$14:P$113,RELAT!$B30)))","v":""},{"$f":"IF(Q$14=0,\"\",IF(Q$31<>\"qualit\",\"Não se aplica\",COUNTIF(PESQ!Q$14:Q$113,RELAT!$B30)))","v":""},{"$f":"IF(R$14=0,\"\",IF(R$31<>\"qualit\",\"Não se aplica\",COUNTIF(PESQ!R$14:R$113,RELAT!$B30)))","v":""},{"$f":"IF(S$14=0,\"\",IF(S$31<>\"qualit\",\"Não se aplica\",COUNTIF(PESQ!S$14:S$113,RELAT!$B30)))","v":""},{"$f":"IF(T$14=0,\"\",IF(T$31<>\"qualit\",\"Não se aplica\",COUNTIF(PESQ!T$14:T$113,RELAT!$B30)))","v":""},{"$f":"IF(U$14=0,\"\",IF(U$31<>\"qualit\",\"Não se aplica\",COUNTIF(PESQ!U$14:U$113,RELAT!$B30)))","v":""},{"$f":"IF(V$14=0,\"\",IF(V$31<>\"qualit\",\"Não se aplica\",COUNTIF(PESQ!V$14:V$113,RELAT!$B30)))","v":""},{"$f":"IF(W$14=0,\"\",IF(W$31<>\"qualit\",\"Não se aplica\",COUNTIF(PESQ!W$14:W$113,RELAT!$B30)))","v":""},{"$f":"IF(X$14=0,\"\",IF(X$31<>\"qualit\",\"Não se aplica\",COUNTIF(PESQ!X$14:X$113,RELAT!$B30)))","v":""},{"$f":"IF(Y$14=0,\"\",IF(Y$31<>\"qualit\",\"Não se aplica\",COUNTIF(PESQ!Y$14:Y$113,RELAT!$B30)))","v":""},{"$f":"IF(Z$14=0,\"\",IF(Z$31<>\"qualit\",\"Não se aplica\",COUNTIF(PESQ!Z$14:Z$113,RELAT!$B30)))","v":""},{"$f":"IF(AA$14=0,\"\",IF(AA$31<>\"qualit\",\"Não se aplica\",COUNTIF(PESQ!AA$14:AA$113,RELAT!$B30)))","v":""},{"$f":"IF(AB$14=0,\"\",IF(AB$31<>\"qualit\",\"Não se aplica\",COUNTIF(PESQ!AB$14:AB$113,RELAT!$B30)))","v":""}]
[null,null,{"$f":"PESQ!C114","v":"bin"},{"$f":"PESQ!D114","v":"avaliacao"},{"$f":"PESQ!E114","v":"qualit"},{"$f":"PESQ!F114","v":"bin"},{"$f":"PESQ!G114","v":"bin"},{"$f":"PESQ!H114","v":"avaliacao"},{"$f":"PESQ!I114","v":""},{"$f":"PESQ!J114","v":""},{"$f":"PESQ!K114","v":""},{"$f":"PESQ!L114","v":""},{"$f":"PESQ!M114","v":""},{"$f":"PESQ!N114","v":""},{"$f":"PESQ!O114","v":""},{"$f":"PESQ!P114","v":""},{"$f":"PESQ!Q114","v":""},{"$f":"PESQ!R114","v":""},{"$f":"PESQ!S114","v":""},{"$f":"PESQ!T114","v":""},{"$f":"PESQ!U114","v":""},{"$f":"PESQ!V114","v":""},{"$f":"PESQ!W114","v":""},{"$f":"PESQ!X114","v":""},{"$f":"PESQ!Y114","v":""},{"$f":"PESQ!Z114","v":""},{"$f":"PESQ!AA114","v":""},{"$f":"PESQ!AB114","v":""}]

{"sheet":"PESQ","index":4,"n_rows":132,"n_cols":28,"rows_kept":132,"merged":[[10,1,10,2],[11,1,12,1],[11,2,12,2],[11,3,12,3],[11,4,12,4],[11,5,12,5],[11,6,12,6],[11,7,12,7],[11,8,12,8],[11,9,12,9],[11,10,12,10],[11,11,12,11],[11,12,12,12],[11,13,12,13],[11,14,12,14],[11,15,12,15],[11,16,12,16],[11,17,12,17],[11,18,12,18],[11,19,12,19],[11,20,12,20],[11,21,12,21],[11,22,12,22],[11,23,12,23],[11,24,12,24],[11,25,12,25],[11,26,12,26],[11,27,12,27],[11,28,12,28],[11,29,12,29],[11,30,12,30],[11,31,12,31],[11,32,12,32],[11,33,12,33],[11,34,12,34],[11,35,12,35],[11,36,12,36],[11,37,12,37],[11,38,12,38],[11,39,12,39],[11,40,12,40],[11,41,12,41],[11,42,12,42],[11,43,12,43],[11,44,12,44],[11,45,12,45],[11,46,12,46],[11,47,12,47],[11,48,12,48],[11,49,12,49],[11,50,12,50],[11,51,12,51]]}
{"$rows_empty":10}
[null,"Pesquisa de Mercado\nInsira as respostas para cada entrevistado."]
[null,"Entrevistado",{"$f":"RESP!$F$15","v":"Você já experimentou algum produto dessa marca?"},{"$f":"RESP!$F$16","v":"O que achou da embalagem do produto?"},{"$f":"RESP!$F$17","v":"Você conhece a Marca X"},{"$f":"RESP!$F$18","v":"Você usaria esse produto no seu dia-a-dia?"},{"$f":"RESP!$F$19","v":"Esse produto atende as suas necessidades?"},{"$f":"RESP!$F$20","v":"O que achou do preço do produto?"},{"$f":"RESP!$F$21","v":0},{"$f":"RESP!$F$22","v":0},{"$f":"RESP!$F$23","v":0},{"$f":"RESP!$F$24","v":0},{"$f":"RESP!$F$25","v":0},{"$f":"RESP!$F$26","v":0},{"$f":"RESP!$F$27","v":0},{"$f":"RESP!$F$28","v":0},{"$f":"RESP!$F$29","v":0},{"$f":"RESP!$F$30","v":0},{"$f":"RESP!$F$31","v":0},{"$f":"RESP!$F$32","v":0},{"$f":"RESP!$F$33","v":0},{"$f":"RESP!$F$34","v":0},{"$f":"RESP!$F$35","v":0},{"$f":"RESP!$F$36","v":0},{"$f":"RESP!$F$37","v":0},{"$f":"RESP!$F$38","v":0},{"$f":"RESP!$F$39","v":0},{"$f":"RESP!$F$40","v":0}]
[]
[null,{"$f":"IF(PERFIL!D15=\"\",\"\",PERFIL!D15)","v":"Entrevistado 1"},"Sim","Excelente",2,"Não","Não","Bom"]
[null,{"$f":"IF(PERFIL!D16=\"\",\"\",PERFIL!D16)","v":"Entrevistado 2"},"Não","Bom",4,"Sim","Sim","Péssimo"]
[null,{"$f":"IF(PERFIL!D17=\"\",\"\",PERFIL!D17)","v":"Entrevistado 3"},"Sim","Ruim",5,"Não","Não","Ruim"]
[null,{"$f":"IF(PERFIL!D18=\"\",\"\",PERFIL!D18)","v":"Entrevistado 4"},"Não","Péssimo",8,"Sim","Não","Bom"]
[null,{"$f":"IF(PERFIL!D19=\"\",\"\",PERFIL!D19)","v":"Entrevistado 5"},"Não","Excelente",10,"Sim","Sim","Excelente"]
[null,{"$f":"IF(PERFIL!D20=\"\",\"\",PERFIL!D20)","v":""}]
[null,{"$f":"IF(PERFIL!D21=\"\",\"\",PERFIL!D21)","v":""}]
[null,{"$f":"IF(PERFIL!D22=\"\",\"\",PERFIL!D22)","v":""}]
[null,{"$f":"IF(PERFIL!D23=\"\",\"\",PERFIL!D23)","v":""}]
[null,{"$f":"IF(PERFIL!D24=\"\",\"\",PERFIL!D24)","v":""}]
[null,{"$f":"IF(PERFIL!D25=\"\",\"\",PERFIL!D25)","v":""}]
[null,{"$f":"IF(PERFIL!D26=\"\",\"\",PERFIL!D26)","v":""}]
[null,{"$f":"IF(PERFIL!D27=\"\",\"\",PERFIL!D27)","v":""}]
[null,{"$f":"IF(PERFIL!D28=\"\",\"\",PERFIL!D28)","v":""}]
[null,{"$f":"IF(PERFIL!D29=\"\",\"\",PERFIL!D29)","v":""}]
[null,{"$f":"IF(PERFIL!D30=\"\",\"\",PERFIL!D30)","v":""}]
[null,{"$f":"IF(PERFIL!D31=\"\",\"\",PERFIL!D31)","v":""}]
[null,{"$f":"IF(PERFIL!D32=\"\",\"\",PERFIL!D32)","v":""}]
[null,{"$f":"IF(PERFIL!D33=\"\",\"\",PERFIL!D33)","v":""}]
[null,{"$f":"IF(PERFIL!D34=\"\",\"\",PERFIL!D34)","v":""}]
[null,{"$f":"IF(PERFIL!D35=\"\",\"\",PERFIL!D35)","v":""}]
[null,{"$f":"IF(PERFIL!D36=\"\",\"\",PERFIL!D36)","v":""}]
[null,{"$f":"IF(PERFIL!D37=\"\",\"\",PERFIL!D37)","v":""}]
[null,{"$f":"IF(PERFIL!D38=\"\",\"\",PERFIL!D38)","v":""}]
[null,{"$f":"IF(PERFIL!D39=\"\",\"\",PERFIL!D39)","v":""}]
[null,{"$f":"IF(PERFIL!D40=\"\",\"\",PERFIL!D40)","v":""}]
[null,{"$f":"IF(PERFIL!D41=\"\",\"\",PERFIL!D41)","v":""}]
[null,{"$f":"IF(PERFIL!D42=\"\",\"\",PERFIL!D42)","v":""}]
[null,{"$f":"IF(PERFIL!D43=\"\",\"\",PERFIL!D43)","v":""}]
[null,{"$f":"IF(PERFIL!D44=\"\",\"\",PERFIL!D44)","v":""}]
[null,{"$f":"IF(PERFIL!D45=\"\",\"\",PERFIL!D45)","v":""}]
[null,{"$f":"IF(PERFIL!D46=\"\",\"\",PERFIL!D46)","v":""}]
[null,{"$f":"IF(PERFIL!D47=\"\",\"\",PERFIL!D47)","v":""}]
[null,{"$f":"IF(PERFIL!D48=\"\",\"\",PERFIL!D48)","v":""}]
[null,{"$f":"IF(PERFIL!D49=\"\",\"\",PERFIL!D49)","v":""}]
[null,{"$f":"IF(PERFIL!D50=\"\",\"\",PERFIL!D50)","v":""}]
[null,{"$f":"IF(PERFIL!D51=\"\",\"\",PERFIL!D51)","v":""}]
[null,{"$f":"IF(PERFIL!D52=\"\",\"\",PERFIL!D52)","v":""}]
[null,{"$f":"IF(PERFIL!D53=\"\",\"\",PERFIL!D53)","v":""}]
[null,{"$f":"IF(PERFIL!D54=\"\",\"\",PERFIL!D54)","v":""}]
[null,{"$f":"IF(PERFIL!D55=\"\",\"\",PERFIL!D55)","v":""}]
[null,{"$f":"IF(PERFIL!D56=\"\",\"\",PERFIL!D56)","v":""}]
[null,{"$f":"IF(PERFIL!D57=\"\",\"\",PERFIL!D57)","v":""}]
[null,{"$f":"IF(PERFIL!D58=\"\",\"\",PERFIL!D58)","v":""}]
[null,{"$f":"IF(PERFIL!D59=\"\",\"\",PERFIL!D59)","v":""}]
[null,{"$f":"IF(PERFIL!D60=\"\",\"\",PERFIL!D60)","v":""}]
[null,{"$f":"IF(PERFIL!D61=\"\",\"\",PERFIL!D61)","v":""}]
[null,{"$f":"IF(PERFIL!D62=\"\",\"\",PERFIL!D62)","v":""}]
[null,{"$f":"IF(PERFIL!D63=\"\",\"\",PERFIL!D63)","v":""}]
[null,{"$f":"IF(PERFIL!D64=\"\",\"\",PERFIL!D64)","v":""}]
[null,{"$f":"IF(PERFIL!D65=\"\",\"\",PERFIL!D65)","v":""}]
[null,{"$f":"IF(PERFIL!D66=\"\",\"\",PERFIL!D66)","v":""}]
[null,{"$f":"IF(PERFIL!D67=\"\",\"\",PERFIL!D67)","v":""}]
[null,{"$f":"IF(PERFIL!D68=\"\",\"\",PERFIL!D68)","v":""}]
[null,{"$f":"IF(PERFIL!D69=\"\",\"\",PERFIL!D69)","v":""}]
[null,{"$f":"IF(PERFIL!D70=\"\",\"\",PERFIL!D70)","v":""}]
[null,{"$f":"IF(PERFIL!D71=\"\",\"\",PERFIL!D71)","v":""}]
[null,{"$f":"IF(PERFIL!D72=\"\",\"\",PERFIL!D72)","v":""}]
[null,{"$f":"IF(PERFIL!D73=\"\",\"\",PERFIL!D73)","v":""}]
[null,{"$f":"IF(PERFIL!D74=\"\",\"\",PERFIL!D74)","v":""}]
[null,{"$f":"IF(PERFIL!D75=\"\",\"\",PERFIL!D75)","v":""}]
[null,{"$f":"IF(PERFIL!D76=\"\",\"\",PERFIL!D76)","v":""}]
[null,{"$f":"IF(PERFIL!D77=\"\",\"\",PERFIL!D77)","v":""}]
[null,{"$f":"IF(PERFIL!D78=\"\",\"\",PERFIL!D78)","v":""}]
[null,{"$f":"IF(PERFIL!D79=\"\",\"\",PERFIL!D79)","v":""}]
[null,{"$f":"IF(PERFIL!D80=\"\",\"\",PERFIL!D80)","v":""}]
[null,{"$f":"IF(PERFIL!D81=\"\",\"\",PERFIL!D81)","v":""}]
[null,{"$f":"IF(PERFIL!D82=\"\",\"\",PERFIL!D82)","v":""}]
[null,{"$f":"IF(PERFIL!D83=\"\",\"\",PERFIL!D83)","v":""}]
[null,{"$f":"IF(PERFIL!D84=\"\",\"\",PERFIL!D84)","v":""}]
[null,{"$f":"IF(PERFIL!D85=\"\",\"\",PERFIL!D85)","v":""}]
[null,{"$f":"IF(PERFIL!D86=\"\",\"\",PERFIL!D86)","v":""}]
[null,{"$f":"IF(PERFIL!D87=\"\",\"\",PERFIL!D87)","v":""}]
[null,{"$f":"IF(PERFIL!D88=\"\",\"\",PERFIL!D88)","v":""}]
[null,{"$f":"IF(PERFIL!D89=\"\",\"\",PERFIL!D89)","v":""}]
[null,{"$f":"IF(PERFIL!D90=\"\",\"\",PERFIL!D90)","v":""}]
[null,{"$f":"IF(PERFIL!D91=\"\",\"\",PERFIL!D91)","v":""}]
[null,{"$f":"IF(PERFIL!D92=\"\",\"\",PERFIL!D92)","v":""}]
[null,{"$f":"IF(PERFIL!D93=\"\",\"\",PERFIL!D93)","v":""}]
[null,{"$f":"IF(PERFIL!D94=\"\",\"\",PERFIL!D94)","v":""}]
[null,{"$f":"IF(PERFIL!D95=\"\",\"\",PERFIL!D95)","v":""}]
[null,{"$f":"IF(PERFIL!D96=\"\",\"\",PERFIL!D96)","v":""}]
[null,{"$f":"IF(PERFIL!D97=\"\",\"\",PERFIL!D97)","v":""}]
[null,{"$f":"IF(PERFIL!D98=\"\",\"\",PERFIL!D98)","v":""}]
[null,{"$f":"IF(PERFIL!D99=\"\",\"\",PERFIL!D99)","v":""}]
[null,{"$f":"IF(PERFIL!D100=\"\",\"\",PERFIL!D100)","v":""}]
[null,{"$f":"IF(PERFIL!D101=\"\",\"\",PERFIL!D101)","v":""}]
[null,{"$f":"IF(PERFIL!D102=\"\",\"\",PERFIL!D102)","v":""}]
[null,{"$f":"IF(PERFIL!D103=\"\",\"\",PERFIL!D103)","v":""}]
[null,{"$f":"IF(PERFIL!D104=\"\",\"\",PERFIL!D104)","v":""}]
[null,{"$f":"IF(PERFIL!D105=\"\",\"\",PERFIL!D105)","v":""}]
[null,{"$f":"IF(PERFIL!D106=\"\",\"\",PERFIL!D106)","v":""}]
[null,{"$f":"IF(PERFIL!D107=\"\",\"\",PERFIL!D107)","v":""}]
[null,{"$f":"IF(PERFIL!D108=\"\",\"\",PERFIL!D108)","v":""}]
[null,{"$f":"IF(PERFIL!D109=\"\",\"\",PERFIL!D109)","v":""}]
[null,{"$f":"IF(PERFIL!D110=\"\",\"\",PERFIL!D110)","v":""}]
[null,{"$f":"IF(PERFIL!D111=\"\",\"\",PERFIL!D111)","v":""}]
[null,{"$f":"IF(PERFIL!D112=\"\",\"\",PERFIL!D112)","v":""}]
[null,{"$f":"IF(PERFIL!D113=\"\",\"\",PERFIL!D113)","v":""}]
[null,{"$f":"IF(PERFIL!D114=\"\",\"\",PERFIL!D114)","v":""}]
[null,null,{"$f":"IFERROR(IF(VLOOKUP(C$12,RESP!$F$15:$G$40,2,0)=\"Binária\",\"bin\",IF(VLOOKUP(C$12,RESP!$F$15:$G$40,2,0)=\"Avaliação\",\"avaliacao\",IF(VLOOKUP(C$12,RESP!$F$15:$G$40,2,0)=\"Qualitativa\",\"qualit\",\"\"))),\"\")","v":"bin"},{"$f":"IFERROR(IF(VLOOKUP(D$12,RESP!$F$15:$G$40,2,0)=\"Binária\",\"bin\",IF(VLOOKUP(D$12,RESP!$F$15:$G$40,2,0)=\"Avaliação\",\"avaliacao\",IF(VLOOKUP(D$12,RESP!$F$15:$G$40,2,0)=\"Qualitativa\",\"qualit\",\"\"))),\"\")","v":"avaliacao"},{"$f":"IFERROR(IF(VLOOKUP(E$12,RESP!$F$15:$G$40,2,0)=\"Binária\",\"bin\",IF(VLOOKUP(E$12,RESP!$F$15:$G$40,2,0)=\"Avaliação\",\"avaliacao\",IF(VLOOKUP(E$12,RESP!$F$15:$G$40,2,0)=\"Qualitativa\",\"qualit\",\"\"))),\"\")","v":"qualit"},{"$f":"IFERROR(IF(VLOOKUP(F$12,RESP!$F$15:$G$40,2,0)=\"Binária\",\"bin\",IF(VLOOKUP(F$12,RESP!$F$15:$G$40,2,0)=\"Avaliação\",\"avaliacao\",IF(VLOOKUP(F$12,RESP!$F$15:$G$40,2,0)=\"Qualitativa\",\"qualit\",\"\"))),\"\")","v":"bin"},{"$f":"IFERROR(IF(VLOOKUP(G$12,RESP!$F$15:$G$40,2,0)=\"Binária\",\"bin\",IF(VLOOKUP(G$12,RESP!$F$15:$G$40,2,0)=\"Avaliação\",\"avaliacao\",IF(VLOOKUP(G$12,RESP!$F$15:$G$40,2,0)=\"Qualitativa\",\"qualit\",\"\"))),\"\")","v":"bin"},{"$f":"IFERROR(IF(VLOOKUP(H$12,RESP!$F$15:$G$40,2,0)=\"Binária\",\"bin\",IF(VLOOKUP(H$12,RESP!$F$15:$G$40,2,0)=\"Avaliação\",\"avaliacao\",IF(VLOOKUP(H$12,RESP!$F$15:$G$40,2,0)=\"Qualitativa\",\"qualit\",\"\"))),\"\")","v":"avaliacao"},{"$f":"IFERROR(IF(VLOOKUP(I$12,RESP!$F$15:$G$40,2,0)=\"Binária\",\"bin\",IF(VLOOKUP(I$12,RESP!$F$15:$G$40,2,0)=\"Avaliação\",\"avaliacao\",IF(VLOOKUP(I$12,RESP!$F$15:$G$40,2,0)=\"Qualitativa\",\"qualit\",\"\"))),\"\")","v":""},{"$f":"IFERROR(IF(VLOOKUP(J$12,RESP!$F$15:$G$40,2,0)=\"Binária\",\"bin\",IF(VLOOKUP(J$12,RESP!$F$15:$G$40,2,0)=\"Avaliação\",\"avaliacao\",IF(VLOOKUP(J$12,RESP!$F$15:$G$40,2,0)=\"Qualitativa\",\"qualit\",\"\"))),\"\")","v":""},{"$f":"IFERROR(IF(VLOOKUP(K$12,RESP!$F$15:$G$40,2,0)=\"Binária\",\"bin\",IF(VLOOKUP(K$12,RESP!$F$15:$G$40,2,0)=\"Avaliação\",\"avaliacao\",IF(VLOOKUP(K$12,RESP!$F$15:$G$40,2,0)=\"Qualitativa\",\"qualit\",\"\"))),\"\")","v":""},{"$f":"IFERROR(IF(VLOOKUP(L$12,RESP!$F$15:$G$40,2,0)=\"Binária\",\"bin\",IF(VLOOKUP(L$12,RESP!$F$15:$G$40,2,0)=\"Avaliação\",\"avaliacao\",IF(VLOOKUP(L$12,RESP!$F$15:$G$40,2,0)=\"Qualitativa\",\"qualit\",\"\"))),\"\")","v":""},{"$f":"IFERROR(IF(VLOOKUP(M$12,RESP!$F$15:$G$40,2,0)=\"Binária\",\"bin\",IF(VLOOKUP(M$12,RESP!$F$15:$G$40,2,0)=\"Avaliação\",\"avaliacao\",IF(VLOOKUP(M$12,RESP!$F$15:$G$40,2,0)=\"Qualitativa\",\"qualit\",\"\"))),\"\")","v":""},{"$f":"IFERROR(IF(VLOOKUP(N$12,RESP!$F$15:$G$40,2,0)=\"Binária\",\"bin\",IF(VLOOKUP(N$12,RESP!$F$15:$G$40,2,0)=\"Avaliação\",\"avaliacao\",IF(VLOOKUP(N$12,RESP!$F$15:$G$40,2,0)=\"Qualitativa\",\"qualit\",\"\"))),\"\")","v":""},{"$f":"IFERROR(IF(VLOOKUP(O$12,RESP!$F$15:$G$40,2,0)=\"Binária\",\"bin\",IF(VLOOKUP(O$12,RESP!$F$15:$G$40,2,0)=\"Avaliação\",\"avaliacao\",IF(VLOOKUP(O$12,RESP!$F$15:$G$40,2,0)=\"Qualitativa\",\"qualit\",\"\"))),\"\")","v":""},{"$f":"IFERROR(IF(VLOOKUP(P$12,RESP!$F$15:$G$40,2,0)=\"Binária\",\"bin\",IF(VLOOKUP(P$12,RESP!$F$15:$G$40,2,0)=\"Avaliação\",\"avaliacao\",IF(VLOOKUP(P$12,RESP!$F$15:$G$40,2,0)=\"Qualitativa\",\"qualit\",\"\"))),\"\")","v":""},{"$f":"IFERROR(IF(VLOOKUP(Q$12,RESP!$F$15:$G$40,2,0)=\"Binária\",\"bin\",IF(VLOOKUP(Q$12,RESP!$F$15:$G$40,2,0)=\"Avaliação\",\"avaliacao\",IF(VLOOKUP(Q$12,RESP!$F$15:$G$40,2,0)=\"Qualitativa\",\"qualit\",\"\"))),\"\")","v":""},{"$f":"IFERROR(IF(VLOOKUP(R$12,RESP!$F$15:$G$40,2,0)=\"Binária\",\"bin\",IF(VLOOKUP(R$12,RESP!$F$15:$G$40,2,0)=\"Avaliação\",\"avaliacao\",IF(VLOOKUP(R$12,RESP!$F$15:$G$40,2,0)=\"Qualitativa\",\"qualit\",\"\"))),\"\")","v":""},{"$f":"IFERROR(IF(VLOOKUP(S$12,RESP!$F$15:$G$40,2,0)=\"Binária\",\"bin\",IF(VLOOKUP(S$12,RESP!$F$15:$G$40,2,0)=\"Avaliação\",\"avaliacao\",IF(VLOOKUP(S$12,RESP!$F$15:$G$40,2,0)=\"Qualitativa\",\"qualit\",\"\"))),\"\")","v":""},{"$f":"IFERROR(IF(VLOOKUP(T$12,RESP!$F$15:$G$40,2,0)=\"Binária\",\"bin\",IF(VLOOKUP(T$12,RESP!$F$15:$G$40,2,0)=\"Avaliação\",\"avaliacao\",IF(VLOOKUP(T$12,RESP!$F$15:$G$40,2,0)=\"Qualitativa\",\"qualit\",\"\"))),\"\")","v":""},{"$f":"IFERROR(IF(VLOOKUP(U$12,RESP!$F$15:$G$40,2,0)=\"Binária\",\"bin\",IF(VLOOKUP(U$12,RESP!$F$15:$G$40,2,0)=\"Avaliação\",\"avaliacao\",IF(VLOOKUP(U$12,RESP!$F$15:$G$40,2,0)=\"Qualitativa\",\"qualit\",\"\"))),\"\")","v":""},{"$f":"IFERROR(IF(VLOOKUP(V$12,RESP!$F$15:$G$40,2,0)=\"Binária\",\"bin\",IF(VLOOKUP(V$12,RESP!$F$15:$G$40,2,0)=\"Avaliação\",\"avaliacao\",IF(VLOOKUP(V$12,RESP!$F$15:$G$40,2,0)=\"Qualitativa\",\"qualit\",\"\"))),\"\")","v":""},{"$f":"IFERROR(IF(VLOOKUP(W$12,RESP!$F$15:$G$40,2,0)=\"Binária\",\"bin\",IF(VLOOKUP(W$12,RESP!$F$15:$G$40,2,0)=\"Avaliação\",\"avaliacao\",IF(VLOOKUP(W$12,RESP!$F$15:$G$40,2,0)=\"Qualitativa\",\"qualit\",\"\"))),\"\")","v":""},{"$f":"IFERROR(IF(VLOOKUP(X$12,RESP!$F$15:$G$40,2,0)=\"Binária\",\"bin\",IF(VLOOKUP(X$12,RESP!$F$15:$G$40,2,0)=\"Avaliação\",\"avaliacao\",IF(VLOOKUP(X$12,RESP!$F$15:$G$40,2,0)=\"Qualitativa\",\"qualit\",\"\"))),\"\")","v":""},{"$f":"IFERROR(IF(VLOOKUP(Y$12,RESP!$F$15:$G$40,2,0)=\"Binária\",\"bin\",IF(VLOOKUP(Y$12,RESP!$F$15:$G$40,2,0)=\"Avaliação\",\"avaliacao\",IF(VLOOKUP(Y$12,RESP!$F$15:$G$40,2,0)=\"Qualitativa\",\"qualit\",\"\"))),\"\")","v":""},{"$f":"IFERROR(IF(VLOOKUP(Z$12,RESP!$F$15:$G$40,2,0)=\"Binária\",\"bin\",IF(VLOOKUP(Z$12,RESP!$F$15:$G$40,2,0)=\"Avaliação\",\"avaliacao\",IF(VLOOKUP(Z$12,RESP!$F$15:$G$40,2,0)=\"Qualitativa\",\"qualit\",\"\"))),\"\")","v":""},{"$f":"IFERROR(IF(VLOOKUP(AA$12,RESP!$F$15:$G$40,2,0)=\"Binária\",\"bin\",IF(VLOOKUP(AA$12,RESP!$F$15:$G$40,2,0)=\"Avaliação\",\"avaliacao\",IF(VLOOKUP(AA$12,RESP!$F$15:$G$40,2,0)=\"Qualitativa\",\"qualit\",\"\"))),\"\")","v":""},{"$f":"IFERROR(IF(VLOOKUP(AB$12,RESP!$F$15:$G$40,2,0)=\"Binária\",\"bin\",IF(VLOOKUP(AB$12,RESP!$F$15:$G$40,2,0)=\"Avaliação\",\"avaliacao\",IF(VLOOKUP(AB$12,RESP!$F$15:$G$40,2,0)=\"Qualitativa\",\"qualit\",\"\"))),\"\")","v":""}]
[null,{"$f":"RESP!B15","v":"Sim"},{"$f":"COUNTIF(C$14:C$113,$B115)","v":2},{"$f":"COUNTIF(D$14:D$113,$B115)","v":0},{"$f":"COUNTIF(E$14:E$113,$B115)","v":0},{"$f":"COUNTIF(F$14:F$113,$B115)","v":3},{"$f":"COUNTIF(G$14:G$113,$B115)","v":2},0,0,0,0,0,0,0,0,0,0,0,0,0,0,0,0,0,0,0,0,0]
[null,{"$f":"RESP!B16","v":"Não"},{"$f":"COUNTIF(C$14:C$113,$B116)","v":3},{"$f":"COUNTIF(D$14:D$113,$B116)","v":0},{"$f":"COUNTIF(E$14:E$113,$B116)","v":0},{"$f":"COUNTIF(F$14:F$113,$B116)","v":2},3,0,0,0,0,0,0,0,0,0,0,0,0,0,0,0,0,0,0,0,0,0]
[]
[null,{"$f":"RESP!C15","v":"Excelente"},0,2,0,0,0,1,0,0,0,0,0,0,0,0,0,0,{"$f":"COUNTIF(S$14:S$113,$B118)","v":0},0,0,0,0,0,0,0,0,0]
[null,{"$f":"RESP!C16","v":"Bom"},0,1,0,0,0,2,0,0,0,0,0,0,0,0,0,0,0,0,0,0,0,0,0,0,0,0]
[null,{"$f":"RESP!C17","v":"Ruim"},0,1,0,0,0,1,0,0,0,0,0,0,0,0,0,0,0,0,0,0,0,0,0,0,0,0]
[null,{"$f":"RESP!C18","v":"Péssimo"},0,1,0,0,0,1,0,0,0,0,0,0,0,0,0,0,0,0,0,0,0,0,0,0,0,0]
[]
[null,{"$f":"RESP!D15","v":1},0,0,0,0,0,0,0,0,0,0,0,0,0,0,0,0,0,0,0,0,0,0,0,0,0,0]
[null,{"$f":"RESP!D16","v":2},0,0,1,0,0,0,0,0,0,0,0,0,0,0,0,0,0,0,0,0,0,0,0,0,0,0]
[null,{"$f":"RESP!D17","v":3},0,0,0,0,0,0,0,0,0,0,0,0,0,0,0,0,0,0,0,0,0,0,0,0,0,0]
[null,{"$f":"RESP!D18","v":4},0,0,1,0,0,0,0,0,0,0,0,0,0,0,0,0,0,0,0,0,0,0,0,0,0,0]
[null,{"$f":"RESP!D19","v":5},0,0,1,0,0,0,0,0,0,0,0,0,0,0,0,0,0,0,0,0,0,0,0,0,0,0]
[null,{"$f":"RESP!D20","v":6},0,0,0,0,0,0,0,0,0,0,0,0,0,0,0,0,0,0,0,0,0,0,0,0,0,0]
[null,{"$f":"RESP!D21","v":7},0,0,0,0,0,0,0,0,0,0,0,0,0,0,0,0,0,0,0,0,0,0,0,0,0,0]
[null,{"$f":"RESP!D22","v":8},0,0,1,0,0,0,0,0,0,0,0,0,0,0,0,0,0,0,0,0,0,0,0,0,0,0]
[null,{"$f":"RESP!D23","v":9},0,0,0,0,0,0,0,{"$f":"COUNTIF(J$14:J$113,$B131)","v":0},0,0,0,0,0,0,0,0,0,0,0,0,0,0,0,0,0,0]
[null,{"$f":"RESP!D24","v":10},0,0,1,0,0,0,0,0,0,0,0,0,0,0,0,0,0,0,0,0,0,0,0,0,0,0]

{"sheet":"Dash","index":5,"n_rows":0,"n_cols":0,"rows_kept":0}

{"sheet":"Dash (2)","index":6,"n_rows":13,"n_cols":4,"rows_kept":13,"merged":[[12,3,12,20]]}
{"$rows_empty":12}
[{"$nulls":3},"O que achou da embalagem do produto?"]

{"sheet":"Instruções","index":7,"n_rows":0,"n_cols":0,"rows_kept":0}

{"sheet":"calc","index":8,"n_rows":18,"n_cols":11,"rows_kept":18}
[{"$f":"RESP!B15","v":"Sim"},{"$f":"COUNTIF(PESQ!$C$14:$AB$113,calc!A1)","v":7},null,"Selecionado:",{"$f":"'Dash (2)'!D13","v":"O que achou da embalagem do produto?"}]
[{"$f":"RESP!B16","v":"Não"},{"$f":"COUNTIF(PESQ!$C$14:$AB$113,calc!A2)","v":8},null,"Tipo de Resposta:",{"$f":"VLOOKUP(E1,RESP!$F$15:$G$114,2,0)","v":"Avaliação"}]
[]
[{"$f":"RESP!C15","v":"Excelente"},{"$f":"COUNTIF(PESQ!$C$14:$AB$113,calc!A4)","v":3},null,{"$f":"IF($E$2=\"Binária\",$A$1,IF($E$2=\"Avaliação\",$A$4,IF($E$2=\"Qualitativa\",$A$9,\"\")))","v":"Excelente"},{"$f":"IFERROR(HLOOKUP($E$1,PESQ!C$12:AB$132,F4,0),\"\")","v":2},{"$f":"IF($E$2=\"Binária\",104,IF($E$2=\"Avaliação\",107,IF($E$2=\"Qualitativa\",112,\"\")))","v":107},null,null,{"$f":"D4","v":"Excelente"},{"$f":"IFERROR(E4/$K$4,\"\")","v":{"v":0.4,"d":"40%"}},{"$f":"SUM(E4:E13)","v":5}]
[{"$f":"RESP!C16","v":"Bom"},{"$f":"COUNTIF(PESQ!$C$14:$AB$113,calc!A5)","v":3},null,{"$f":"IF($E$2=\"Binária\",A2,IF($E$2=\"Avaliação\",A5,IF($E$2=\"Qualitativa\",A10,\"\")))","v":"Bom"},{"$f":"IFERROR(HLOOKUP($E$1,PESQ!C$12:AB$132,F5,0),\"\")","v":1},{"$f":"IF(D5=\"\",\"\",F4+1)","v":108},null,null,{"$f":"D5","v":"Bom"},{"$f":"IFERROR(E5/$K$4,\"\")","v":{"v":0.2,"d":"20%"}}]
[{"$f":"RESP!C17","v":"Ruim"},{"$f":"COUNTIF(PESQ!$C$14:$AB$113,calc!A6)","v":2},null,{"$f":"IF($E$2=\"Avaliação\",A6,IF($E$2=\"Qualitativa\",A11,\"\"))","v":"Ruim"},{"$f":"IFERROR(HLOOKUP($E$1,PESQ!C$12:AB$132,F6,0),\"\")","v":1},{"$f":"IF(D6=\"\",\"\",F5+1)","v":109},null,null,"Ruim",{"v":0.2,"d":"20%"}]
[{"$f":"RESP!C18","v":"Péssimo"},{"$f":"COUNTIF(PESQ!$C$14:$AB$113,calc!A7)","v":2},null,{"$f":"IF($E$2=\"Avaliação\",A7,IF($E$2=\"Qualitativa\",A12,\"\"))","v":"Péssimo"},{"$f":"IFERROR(HLOOKUP($E$1,PESQ!C$12:AB$132,F7,0),\"\")","v":1},110,null,null,"Péssimo",{"v":0.2,"d":"20%"}]
[{"$nulls":3},{"$f":"IF($E$2=\"Qualitativa\",A13,\"\")","v":""},{"$f":"IFERROR(HLOOKUP($E$1,PESQ!C$12:AB$132,F8,0),\"\")","v":""},"",null,null,"",""]
[{"$f":"RESP!D15","v":1},{"$f":"COUNTIF(PESQ!$C$14:$AB$113,calc!A9)","v":0},null,{"$f":"IF($E$2=\"Qualitativa\",A14,\"\")","v":""},{"$f":"IFERROR(HLOOKUP($E$1,PESQ!C$12:AB$132,F9,0),\"\")","v":""},"",null,null,"",""]
[{"$f":"RESP!D16","v":2},{"$f":"COUNTIF(PESQ!$C$14:$AB$113,calc!A10)","v":1},null,"",{"$f":"IFERROR(HLOOKUP($E$1,PESQ!C$12:AB$132,F10,0),\"\")","v":""},"",null,null,"",""]
[{"$f":"RESP!D17","v":3},{"$f":"COUNTIF(PESQ!$C$14:$AB$113,calc!A11)","v":0},null,"",{"$f":"IFERROR(HLOOKUP($E$1,PESQ!C$12:AB$132,F11,0),\"\")","v":""},"",null,null,"",""]
[{"$f":"RESP!D18","v":4},{"$f":"COUNTIF(PESQ!$C$14:$AB$113,calc!A12)","v":1},null,"",{"$f":"IFERROR(HLOOKUP($E$1,PESQ!C$12:AB$132,F12,0),\"\")","v":""},"",null,null,"",""]
[{"$f":"RESP!D19","v":5},{"$f":"COUNTIF(PESQ!$C$14:$AB$113,calc!A13)","v":1},null,"",{"$f":"IFERROR(HLOOKUP($E$1,PESQ!C$12:AB$132,F13,0),\"\")","v":""},"",null,null,"",""]
[{"$f":"RESP!D20","v":6},{"$f":"COUNTIF(PESQ!$C$14:$AB$113,calc!A14)","v":0}]
[{"$f":"RESP!D21","v":7},{"$f":"COUNTIF(PESQ!$C$14:$AB$113,calc!A15)","v":0}]
[{"$f":"RESP!D22","v":8},{"$f":"COUNTIF(PESQ!$C$14:$AB$113,calc!A16)","v":1}]
[{"$f":"RESP!D23","v":9},{"$f":"COUNTIF(PESQ!$C$14:$AB$113,calc!A17)","v":0}]
[{"$f":"RESP!D24","v":10},{"$f":"COUNTIF(PESQ!$C$14:$AB$113,calc!A18)","v":1}]