{"text_format":"3","workbook":"xlsx","n_sheets":6,"sheets":["Menu","1ºP","2ºP","Resultado","Instruções","Custos"],"not_rendered":{"images":6,"macros":1,"defined_names":4,"comments":3},"read":"whole","date_system":"1900"}

{"sheet":"Menu","index":0,"n_rows":26,"n_cols":14,"rows_kept":26,"merged":[[25,4,25,5],[25,6,25,10],[25,11,25,12],[25,13,25,16]]}
{"$rows_empty":25}
[{"$nulls":4},"Empresa:",null,"Empresa ABCDE",{"$nulls":4},"Segmento:",null,"Segmento 1"]

{"sheet":"1ºP","index":1,"n_rows":95,"n_cols":19,"rows_kept":95,"merged":[[9,2,9,6],[9,7,9,8],[9,9,9,12],[9,14,9,15],[11,7,12,8],[11,11,12,12],[11,14,12,15],[11,17,12,18],[16,1,16,9],[16,11,16,19],[18,2,18,9],[18,12,18,19],[20,2,20,9],[20,12,20,19],[22,2,22,9],[22,12,22,19],[24,2,24,9],[24,12,24,19],[26,2,26,9],[26,12,26,19],[28,2,28,9],[28,12,28,19],[30,2,30,9],[30,12,30,19],[32,2,32,9],[32,12,32,19],[34,2,34,9],[34,12,34,19],[36,2,36,9],[36,12,36,19],[38,1,38,9],[38,11,38,19],[39,2,39,6],[39,8,39,9],[39,12,39,16],[39,18,39,19],[41,2,41,9],[41,12,41,19],[43,2,43,9],[43,12,43,19],[45,1,45,9],[45,11,45,19],[46,1,46,9],[46,11,46,19],[47,1,47,3],[47,4,47,6],[47,7,47,9],[47,11,47,13],[47,14,47,16],[47,17,47,19],[48,1,48,3],[48,4,48,6],[48,7,48,9],[48,11,48,13],[48,14,48,16],[48,17,48,19],[49,1,49,9],[49,11,49,13],[49,14,49,16],[49,17,49,19],[50,1,50,3],[50,4,50,6],[50,7,50,9],[50,11,50,13],[50,14,50,16],[50,17,50,19],[51,1,51,3],[51,4,51,6],[51,7,51,9],[51,11,51,13],[51,14,51,16],[51,17,51,19],[52,1,52,9],[52,11,52,13],[52,14,52,16],[52,17,52,19],[53,1,53,3],[53,4,53,6],[53,7,53,9],[53,11,53,13],[53,14,53,16],[53,17,53,19],[54,1,54,3],[54,4,54,6],[54,7,54,9],[54,11,54,13],[54,14,54,16],[54,17,54,19],[56,1,56,9],[56,11,56,19],[58,2,58,9],[58,12,58,19],[60,2,60,9],[60,12,60,19],[62,2,62,9],[62,12,62,19],[64,2,64,9],[64,12,64,19],[66,2,66,9],[66,12,66,19],[68,2,68,9],[68,12,68,19],[70,2,70,9],[70,12,70,19],[72,2,72,9],[72,12,72,19],[74,2,74,6],[74,8,74,9],[74,12,74,16],[74,18,74,19],[76,2,76,9],[76,12,76,19],[78,1,78,9],[78,11,78,19],[79,2,79,9],[79,12,79,19],[81,2,81,9],[81,12,81,19],[83,2,83,9],[83,12,83,19],[85,1,85,9],[85,11,85,19],[86,1,86,9],[86,11,86,19],[87,1,87,3],[87,4,87,6],[87,7,87,9],[87,11,87,13],[87,14,87,16],[87,17,87,19],[88,1,88,3],[88,4,88,6],[88,7,88,9],[88,11,88,13],[88,14,88,16],[88,17,88,19],[89,1,89,9],[89,11,89,19],[90,1,90,3],[90,4,90,6],[90,7,90,9],[90,11,90,13],[90,14,90,16],[90,17,90,19],[91,1,91,3],[91,4,91,6],[91,7,91,9],[91,11,91,13],[91,14,91,16],[91,17,91,19],[92,1,92,9],[92,11,92,19],[93,1,93,3],[93,4,93,6],[93,7,93,9],[93,11,93,13],[93,14,93,16],[93,17,93,19],[94,1,94,3],[94,4,94,6],[94,7,94,9],[94,11,94,13],[94,14,94,16],[94,17,94,19]]}
{"$rows_empty":9}
[null,"Empresa:",{"$f":"Menu!G26","v":"Empresa ABCDE"},{"$nulls":4},"Segmento:",null,{"$f":"Menu!N26","v":"Segmento 1"},{"$nulls":3},"Data:",{"$f":"TODAY()","v":"2024-01-26"}]
[]
[{"$nulls":7},"Master Card",{"$nulls":3},"Visa",null,null,"Elo",null,null,"Cielo"]
[]
[]
[null,"Verifique as condições financeiras da sua credenciadora. Essas informações podem ser consultadas nas faturas, maquininhas ou no contrato."]
[]
[null,{"$f":"UPPER('1ºP'!H12)","v":"MASTER CARD"},{"$nulls":9},{"$f":"UPPER('1ºP'!L12)","v":"VISA"}]
[]
[null,"%","DESCRIÇÃO",{"$nulls":8},"%","DESCRIÇÃO"]
[]
[null,{"$f":"B23+B27+B31+B35","v":{"v":0.74,"d":"74.00%"}},"% de Vendas em Relação as Vendas Totais da Empresa",{"$nulls":8},{"$f":"IFERROR(L23+L27+L31+L35,0)","v":{"v":0.74,"d":"74.00%"}},"% de Vendas em Relação as Vendas Totais da Empresa"]
[]
[null,{"v":0.6,"d":"60.00%"},"% de Vendas DÉBITO sobre Vendas Totais",{"$nulls":8},{"$f":"IF($L$25=0,\" \",'1ºP'!B23)","v":{"v":0.6,"d":"60.00%"}},"% de Vendas DÉBITO sobre Vendas Totais"]
[]
[null,{"v":0.05,"d":"5.00%"},"Taxa de Administração para o Cartão de DÉBITO",{"$nulls":8},{"v":0.04,"d":"4.00%"},"Taxa de Administração para o Cartão de DÉBITO"]
[]
[null,{"v":0.03,"d":"3.00%"},"% de Vendas CRÉDITO A VISTA (30 dias) sobre as Vendas Totais",{"$nulls":8},{"$f":"IF($L$25=0,\" \",'1ºP'!B27)","v":{"v":0.03,"d":"3.00%"}},"% de Vendas CRÉDITO A VISTA (30 dias) sobre as Vendas Totais"]
[]
[null,{"v":0.02,"d":"2.00%"},"Taxa de Administração para o Cartão de CRÉDITO (30 dias)",{"$nulls":8},{"v":0.03,"d":"3.00%"},"Taxa de Administração para o Cartão de CRÉDITO (30 dias)"]
[]
[null,{"v":0.06,"d":"6.00%"},"% de Vendas Cartão de CRÉDITO PARCELADO sobre as Vendas com Cartão",{"$nulls":8},{"$f":"IF($L$25=0,\" \",'1ºP'!B31)","v":{"v":0.06,"d":"6.00%"}},"% de Vendas Cartão de CRÉDITO PARCELADO sobre as Vendas com Cartão"]
[]
[null,{"v":0.05,"d":"5.00%"},"Taxa de Administração para o Cartão de CRÉDITO PARCELADO (até 12x)",{"$nulls":8},{"v":0.04,"d":"4.00%"},"Taxa de Administração para o Cartão de CRÉDITO PARCELADO (até 12x)"]
[]
[null,{"v":0.05,"d":"5.00%"},"% de Vendas CREDIÁRIO sobre Vendas com Cartão ",{"$nulls":8},{"$f":"IF($L$25=0,\" \",'1ºP'!B35)","v":{"v":0.05,"d":"5.00%"}},"% de Vendas CREDIÁRIO sobre Vendas com Cartão "]
[]
[null,{"v":0.06,"d":"6.00%"},"Taxa de Administração para a Modalidade CREDIÁRIO",{"$nulls":8},{"v":0.08,"d":"8.00%"},"Taxa de Administração para a Modalidade CREDIÁRIO"]
[]
[null,"ANTECIPAÇÃO DE RECEBÍVEIS",{"$nulls":9},"ANTECIPAÇÃO DE RECEBÍVEIS"]
[null,{"v":0.5,"d":"50.00%"},"% de Vendas ANTECIPADO (Recebíveis Com Cartão)",{"$nulls":4},"R$",{"$f":"(('2ºP'!J27)*('1ºP'!B27+'1ºP'!B31))*'1ºP'!B40","v":{"v":1170,"d":"1,170.00"}},null,null,{"$f":"IF($L$25=0,\" \",'1ºP'!B40)","v":{"v":0.5,"d":"50.00%"}},"% de Vendas ANTECIPADO (Recebíveis Com Cartão)",{"$nulls":4},"R$",{"$f":"IF('1ºP'!L25=0,\" \",'1ºP'!$I$40)","v":{"v":1170,"d":"1,170.00"}}]
[]
[null,{"v":0.05,"d":"5.00%"},"Taxa de Antecipação de Recebíveis",{"$nulls":8},{"v":0.07,"d":"7.00%"},"Taxa de Antecipação de Recebíveis"]
[]
[null,10,"Prazo Médio de Antecipação",{"$nulls":8},15,"Prazo Médio de Antecipação"]
[]
[null,{"$f":"'1ºP'!B17","v":"MASTER CARD"},{"$nulls":9},{"$f":"L17","v":"VISA"}]
[null,"Aluguel das Máquinas",{"$nulls":9},"Aluguel das Máquinas"]
[null,"POS (R$)",null,null,"PDV(R$)",null,null,"POO(R$)",{"$nulls":3},"POS (R$)",null,null,"PDV(R$)",null,null,"POO(R$)"]
{"$rows_left_out":48}
{"sheet":"2ºP","index":2,"n_rows":58,"n_cols":14,"rows_kept":58,"merged":[[9,2,9,6],[9,7,9,8],[9,9,9,11],[9,13,9,14],[11,1,11,12],[13,9,13,10],[13,11,13,12],[15,9,15,10],[15,11,15,12],[17,9,17,10],[17,11,17,12],[19,9,19,10],[19,11,19,12],[21,9,21,10],[21,11,21,12],[23,1,23,8],[23,9,23,12],[24,1,24,12],[26,1,26,8],[26,9,26,10],[26,11,26,12],[28,1,28,8],[28,9,28,10],[28,11,28,12],[30,1,30,8],[30,9,30,10],[30,11,30,12],[32,1,32,8],[32,9,32,10],[32,11,32,12],[34,1,34,8],[34,9,34,10],[34,11,34,12],[35,1,35,12],[37,1,37,8],[37,9,37,10],[37,11,37,12],[39,1,39,8],[39,9,39,10],[39,11,39,12],[41,1,41,8],[41,9,41,10],[41,11,41,12],[43,1,43,8],[43,9,43,10],[43,11,43,12],[46,1,46,12],[47,2,47,9],[47,10,47,12],[48,2,48,9],[48,10,48,12],[49,2,49,9],[49,10,49,12],[50,2,50,9],[50,10,50,12],[51,2,51,9],[51,10,51,12],[52,2,52,9],[52,10,52,12],[54,1,54,12],[55,1,55,4],[55,5,55,8],[55,9,55,12],[56,1,56,4],[56,5,56,8],[56,9,56,12],[57,1,57,4],[57,5,57,8],[57,9,57,12]]}
{"$rows_empty":9}
[null,"Empresa:",{"$f":"Menu!G26","v":"Empresa ABCDE"},{"$nulls":4},"Segmento:",null,{"$f":"Menu!N26","v":"Segmento 1"},null,null,"Data:",{"$f":"TODAY()","v":"2024-01-26"}]
[]
[null,"Lançamento de Receitas e Despesas"]
[]
[null,"RECEITA MÉDIA ATUAL (MENSAL)",{"$nulls":7},{"v":20000,"d":"20,000.00"},null,{"$f":"IFERROR('2ºP'!J14/'2ºP'!J14,0)","v":{"v":1,"d":"100.00%"}}]
[]
[null,"DESPESAS TOTAIS (EXCETO IMPOSTOS)",{"$nulls":7},{"v":5000,"d":"5,000.00"},null,{"$f":"IFERROR('2ºP'!J16/'2ºP'!J14,0)","v":{"v":0.25,"d":"25.00%"}}]
[]
[null,"IMPOSTOS (%)",{"$nulls":7},{"$f":"'2ºP'!J14*'2ºP'!L18","v":{"v":2000,"d":"2,000.00"}},null,{"v":0.1,"d":"10.00%"}]
[]
[null,"SOMATÓRIO DAS DESPESAS",{"$nulls":7},{"$f":"'2ºP'!J16+'2ºP'!J18","v":{"v":7000,"d":"7,000.00"}},null,{"$f":"IFERROR('2ºP'!J20/'2ºP'!J14,0)","v":{"v":0.35,"d":"35.00%"}}]
[]
[null,"LUCRO MENSAL (atual)",{"$nulls":7},{"$f":"'2ºP'!J14-'2ºP'!J20","v":{"v":13000,"d":"13,000.00"}},null,{"$f":"IFERROR('2ºP'!J22/'2ºP'!J14,0)","v":{"v":0.65,"d":"65.00%"}}]
[]
[null,"INCREMENTO ESPERADO (%)",{"$nulls":7},{"v":0.3,"d":"30.00%"}]
[null,"OBS: Apenas para empresas que ainda não aceitam cartões."]
[]
[null,"RECEITA (APÓS INCREMENTO ESPERADO)",{"$nulls":7},{"$f":"'2ºP'!J14+('2ºP'!J14*J24)","v":{"v":26000,"d":"26,000.00"}},null,{"$f":"IFERROR('2ºP'!J27/'2ºP'!J27,0)","v":{"v":1,"d":"100.00%"}}]
[]
[null,{"$f":"'2ºP'!B16","v":"DESPESAS TOTAIS (EXCETO IMPOSTOS)"},{"$nulls":7},{"$f":"'2ºP'!J16","v":{"v":5000,"d":"5,000.00"}},null,{"$f":"IFERROR('2ºP'!J29/'2ºP'!J27,0)","v":{"v":0.19230769230769232,"d":"19.23%"}}]
[]
[null,"IMPOSTOS (%)",{"$nulls":7},{"$f":"IFERROR(J27*'2ºP'!L31,0)","v":{"v":2600,"d":"2,600.00"}},null,{"$f":"IF(L18=\"\",\"\",'2ºP'!L18)","v":{"v":0.1,"d":"10.00%"}}]
[]
[null,{"$f":"'2ºP'!B20","v":"SOMATÓRIO DAS DESPESAS"},{"$nulls":7},{"$f":"IFERROR(J29+J31,0)","v":{"v":7600,"d":"7,600.00"}},null,{"$f":"IFERROR('2ºP'!J33/'2ºP'!J27,0)","v":{"v":0.2923076923076923,"d":"29.23%"}}]
[]
[null,"OUTRAS DESPESAS APÓS IMPLEMENTAÇÃO DO CARTÃO",{"$nulls":7},{"v":2000,"d":"2,000.00"},null,{"$f":"IFERROR('2ºP'!J35/'2ºP'!J27,0)","v":{"v":0.07692307692307693,"d":"7.69%"}}]
[null,"OBS: Apenas para empresas que ainda não aceitam cartões."]
[]
[null,"DESPESAS C/ APENAS UM CARTÃO",{"$nulls":7},{"$f":"Resultado!E27","v":{"v":852.7183078165735,"d":"852.72"}},null,{"$f":"'2ºP'!J38/'2ºP'!J29","v":{"v":0.1705436615633147,"d":"17.05%"}}]
[]
[null,"LUCRO MENSAL  C/ INCREMENTO",{"$nulls":7},{"$f":"'2ºP'!$J$27-'2ºP'!$J$33-'2ºP'!$J$35-J38","v":{"v":15547.281692183427,"d":"15,547.28"}},null,{"$f":"'2ºP'!J40/'2ºP'!J27","v":{"v":0.5979723727762857,"d":"59.80%"}}]
[]
[null,"DESPESAS C/TODOS CARTÕES",{"$nulls":7},{"$f":"Resultado!L27","v":{"v":1823.1925760533231,"d":"1,823.19"}},null,{"$f":"'2ºP'!J42/'2ºP'!$J$29","v":{"v":0.36463851521066465,"d":"36.46%"}}]
[]
[null,"LUCRO MENSAL C/ INCREMENTO",{"$nulls":7},{"$f":"'2ºP'!$J$27-'2ºP'!$J$33-'2ºP'!$J$35-J42","v":{"v":14576.807423946677,"d":"14,576.81"}},null,{"$f":"'2ºP'!J44/'2ºP'!$J$27","v":{"v":0.5606464393825645,"d":"56.06%"}}]
[]
[]
[null,"MELHOR CONDIÇÃO (credenciadora):    TAXAS"]
[null,"%","DESCRIÇÃO",{"$nulls":7},"CREDENCIADORA"]
{"$rows_left_out":11}
{"sheet":"Resultado","index":3,"n_rows":97,"n_cols":15,"rows_kept":97,"merged":[[9,2,9,6],[9,9,9,12],[9,14,9,15],[11,1,11,13],[13,1,13,6],[13,8,13,13],[14,1,14,6],[14,8,14,13],[15,1,15,6],[15,8,15,13],[16,1,16,6],[16,8,16,13],[17,2,17,3],[17,4,17,5],[17,9,17,10],[17,11,17,12],[18,2,18,3],[18,4,18,5],[18,9,18,10],[18,11,18,12],[19,2,19,3],[19,4,19,5],[19,9,19,10],[19,11,19,12],[21,1,21,6],[21,8,21,13],[24,3,24,4],[24,10,24,11],[26,5,26,6],[26,12,26,13],[39,1,39,13],[41,1,41,6],[41,8,41,13],[42,1,42,6],[42,8,42,13],[43,1,43,6],[43,8,43,13],[44,2,44,3],[44,4,44,5],[44,9,44,10],[44,11,44,12],[45,2,45,3],[45,4,45,5],[45,9,45,10],[45,11,45,12],[46,2,46,3],[46,4,46,5],[46,9,46,10],[46,11,46,12],[48,1,48,6],[48,8,48,13],[51,3,51,4],[51,10,51,11],[53,5,53,6],[66,1,66,6],[66,8,66,13],[67,1,67,6],[67,8,67,13],[68,1,68,6],[68,8,68,13],[69,4,69,5],[69,9,69,10],[69,11,69,12],[70,4,70,5],[70,9,70,10],[70,11,70,12],[71,4,71,5],[71,9,71,10],[71,11,71,12],[73,1,73,6],[73,8,73,13],[76,3,76,4],[76,10,76,11],[78,5,78,6]]}
{"$rows_empty":9}
[null,"Empresa:",{"$f":"Menu!G26","v":"Empresa ABCDE"},{"$nulls":5},"Segmento:",{"$f":"Menu!N26","v":"Segmento 1"},{"$nulls":3},"Data:",{"$f":"TODAY()","v":"2024-01-26"}]
[]
[null,"ANÁLISE FINAL"]
[]
[null,"MELHOR CONDIÇÃO:",{"$nulls":6},"UTILIZANDO TODOS OS CARTÕES:"]
[null,{"$f":"IF(Resultado!E19=Resultado!E46,B42,)&IF(Resultado!E19=Resultado!L46,Resultado!I42,)&IF(Resultado!E19=Resultado!E71,B67,)&IF(Resultado!E19=Resultado!L71,Resultado!I67,)","v":"VISA"},{"$nulls":6},{"$f":"UPPER(CONCATENATE(Resultado!B42&\" + \",I42&\" + \",Resultado!B67&\" + \",I67))","v":"MASTER CARD + VISA + ELO + CIELO"}]
[null,"FLUXO DE CAIXA",{"$nulls":6},"FLUXO DE CAIXA"]
[null,"Situação COM a Utilização do Cartão de Pagamento",{"$nulls":6},"Situação COM a Utilização dos Cartões de Pagamento"]
[null,null,"Faturamento Mensal",null,{"$f":"'2ºP'!J27","v":{"v":26000,"d":"26,000.00"}},null,{"$f":"IF(Resultado!E18=0,0,Resultado!E18/Resultado!E18)","v":{"v":1,"d":"100.00%"}},null,null,"Faturamento Mensal",null,{"$f":"Resultado!E18","v":{"v":26000,"d":"26,000.00"}},null,{"$f":"IF(Resultado!L18=0,0,Resultado!L18/Resultado!L18)","v":{"v":1,"d":"100.00%"}}]
[null,null,"Despesas Totais",null,{"$f":"IF(MIN(Resultado!$C$93:$C$96)=0,LARGE(Resultado!$C$93:$C$96,COUNTIF(Resultado!$C$93:$C$96,\"<>0\")),MIN(Resultado!$C$93:$C$96))","v":{"v":10452.718307816573,"d":"10,452.72"}},null,{"$f":"IF(Resultado!E19=0,0,Resultado!E19/Resultado!E18)","v":{"v":0.4020276272237143,"d":"40.20%"}},null,null,"Despesas Totais",null,{"$f":"Custos!P7+Custos!P12+Custos!P17+Custos!P22","v":{"v":1823.1925760533231,"d":"1,823.19"}},null,{"$f":"IF(Resultado!L19=0,0,Resultado!L19/Resultado!L18)","v":{"v":0.07012279138666627,"d":"7.01%"}}]
[null,null,"Lucro Operacional",null,{"$f":"Resultado!E18-E19","v":{"v":15547.281692183427,"d":"15,547.28"}},null,{"$f":"IF(Resultado!E20=0,0,Resultado!E20/Resultado!E18)","v":{"v":0.5979723727762857,"d":"59.80%"}},null,null,"Lucro Operacional",null,{"$f":"L18-L19","v":{"v":24176.807423946677,"d":"24,176.81"}},null,{"$f":"IF(Resultado!L20=0,0,Resultado!L20/Resultado!L18)","v":{"v":0.9298772086133337,"d":"92.99%"}}]
[]
[null,"IMPACTO COM A ADOÇÃO DO CARTÃO DE PAGAMENTO",{"$nulls":6},"IMPACTO COM A ADOÇÃO DOS CARTÕES DE PAGAMENTO"]
[]
[null,"O lucro da empresa passará de ",null,null,{"$f":"'2ºP'!J22","v":{"v":13000,"d":"13,000.00"}},"reais",null,null,"O lucro da empresa passará de ",null,null,{"$f":"'2ºP'!J22","v":{"v":13000,"d":"13,000.00"}},"reais"]
[null,"para",{"$f":"Resultado!E20","v":{"v":15547.281692183427,"d":"15,547.28"}},{"$f":"IF(Resultado!F25>0,\"com aumento de\",\"com uma queda de\")","v":"com aumento de"},null,{"$f":"Resultado!C25-Resultado!E24","v":{"v":2547.2816921834274,"d":"2,547.28"}},null,null,"para",{"$f":"Resultado!L20","v":{"v":24176.807423946677,"d":"24,176.81"}},{"$f":"IF(Resultado!M25>0,\"com aumento de\",\"com uma queda de\")","v":"com aumento de"},null,{"$f":"Resultado!J25-Resultado!L24","v":{"v":11176.807423946677,"d":"11,176.81"}}]
[]
[null,"A despesa com cartão será de ",null,null,{"$f":"VLOOKUP(Resultado!B15,Resultado!B93:F96,3,0)","v":{"v":852.7183078165735,"d":"852.72"}},"c/aumento",null,null,"A despesa com cartão será de ",null,null,{"$f":"D97","v":{"v":1823.1925760533231,"d":"1,823.19"}},"c/aumento"]
[null,"de",{"$f":"(Resultado!E19/'2ºP'!J33)-1","v":{"v":0.375357672081128,"d":"37.54%"}},"nas despesas totais,   representando",{"$nulls":4},"de ",{"$f":"(Resultado!L19/'2ºP'!J33)-1","v":{"v":-0.7601062399929838,"d":"-76.01%"}},"nas despesas totais,   representando"]
[null,{"$f":"Resultado!E27/Resultado!E18","v":{"v":0.032796857992945135,"d":"3.3%"}},"do faturamento bruto.",{"$nulls":5},{"$f":"Resultado!L27/Resultado!L18","v":{"v":0.07012279138666627,"d":"7.0%"}},"do faturamento bruto."]
[]
[null,"A despesa de administração representará ",{"$nulls":3},{"$f":"VLOOKUP(Resultado!B15,Resultado!B93:G96,4,0)","v":{"v":813.8,"d":"813.80"}},"reais",null,"A despesa de administração representará ",{"$nulls":3},{"$f":"Resultado!E97","v":{"v":1765.4,"d":"1,765.40"}},"reais"]
[null,"ou",{"$f":"Resultado!F31/Resultado!E18","v":{"v":0.0313,"d":"3.1%"}},"do faturamento bruto.",{"$nulls":4},"ou",{"$f":"Resultado!M31/Resultado!L18","v":{"v":0.0679,"d":"6.8%"}},"do faturamento bruto."]
[]
[null,"A despesa fixa com cartão representará",{"$nulls":3},{"$f":"VLOOKUP(Resultado!B15,Resultado!B93:F96,5,0)","v":0},"reais",null,"A despesa fixa com cartão representará",{"$nulls":3},{"$f":"Resultado!F97","v":0},"reais"]
[null,"ou",{"$f":"Resultado!F34/Resultado!E18","v":{"v":0,"d":"0.0%"}},"do faturamento bruto.",{"$nulls":4},"ou",{"$f":"Resultado!M34/Resultado!L18","v":{"v":0,"d":"0.0%"}},"do faturamento bruto."]
[]
[null,"O custo com antecip. de recebíveis será",{"$nulls":3},{"$f":"VLOOKUP(Resultado!$B$15,Resultado!$B$93:$G$96,6,0)","v":{"v":38.91830781657359,"d":"38.92"}},"reais",null,"O custo com antecip. de recebíveis será",{"$nulls":3},{"$f":"Resultado!G97","v":{"v":57.79257605332327,"d":"57.79"}},"reais"]
[null,"ou",{"$f":"Resultado!F37/Resultado!$E$18","v":{"v":0.001496857992945138,"d":"0.1%"}},"do faturamento bruto.",{"$nulls":4},"ou",{"$f":"Resultado!M37/Resultado!$L$18","v":{"v":2.2227913866662797E-3,"d":"0.2%"}},"do faturamento bruto."]
[]
[null,"Confira o impacto financeiro separado por credenciadora"]
[]
[null,{"$f":"'1ºP'!B17","v":"MASTER CARD"},{"$nulls":6},{"$f":"'1ºP'!L17","v":"VISA"}]
[null,"FLUXO DE CAIXA",{"$nulls":6},"FLUXO DE CAIXA"]
[null,"Situação COM a Utilização dos Cartões de Pagamento",{"$nulls":6},"Situação COM a Utilização dos Cartões de Pagamento"]
[null,null,"Faturamento Mensal",null,{"$f":"IF('1ºP'!B21=0%,0,Resultado!L18)","v":{"v":26000,"d":"26,000.00"}},null,{"$f":"IF(Resultado!E45=0,0,Resultado!E45/Resultado!E45)","v":{"v":1,"d":"100.00%"}},null,null,"Faturamento Mensal",null,{"$f":"IF('1ºP'!L21=0%,0,Resultado!L18)","v":{"v":26000,"d":"26,000.00"}},null,{"$f":"IF(Resultado!L45=0,0,Resultado!L45/Resultado!L45)","v":{"v":1,"d":"100.00%"}}]
[null,null,"Despesas Totais",null,{"$f":"('2ºP'!J33)+Custos!P7+'2ºP'!J35","v":{"v":10570.47426823675,"d":"10,570.47"}},null,{"$f":"IF(Resultado!E46=0,0,Resultado!E46/Resultado!E45)","v":{"v":0.4065567026244904,"d":"40.66%"}},null,null,"Despesas Totais",null,{"$f":"IF(Resultado!L45=0,0,(('2ºP'!J33)+Custos!P12+'2ºP'!J35))","v":{"v":10452.718307816573,"d":"10,452.72"}},null,{"$f":"IF(Resultado!L46=0,0,Resultado!L46/Resultado!L45)","v":{"v":0.4020276272237143,"d":"40.20%"}}]
[null,null,"Lucro Operacional",null,{"$f":"E45-E46","v":{"v":15429.52573176325,"d":"15,429.53"}},null,{"$f":"IF(Resultado!E47=0,0,Resultado!E47/Resultado!E45)","v":{"v":0.5934432973755096,"d":"59.34%"}},null,null,"Lucro Operacional",null,{"$f":"Resultado!L45-Resultado!L46","v":{"v":15547.281692183427,"d":"15,547.28"}},null,{"$f":"IF(Resultado!L47=0,0,Resultado!L47/Resultado!L45)","v":{"v":0.5979723727762857,"d":"59.80%"}}]
[]
{"$rows_left_out":50}
{"sheet":"Instruções","index":4,"n_rows":0,"n_cols":0,"rows_kept":0}

{"sheet":"Custos","index":5,"n_rows":22,"n_cols":16,"rows_kept":22,"hidden":true,"merged":[[1,9,1,12],[2,1,6,1],[2,14,2,15],[3,14,3,15],[7,1,11,1],[7,14,7,15],[8,14,8,15],[12,1,16,1],[12,14,12,15],[13,14,13,15],[17,1,21,1],[17,14,17,15],[18,14,18,15],[22,9,22,11],[22,14,22,15]]}
[]
[]
[null,{"$f":"'2ºP'!J27","v":{"v":26000,"d":"26,000.00"}},{"$f":"'1ºP'!B23","v":{"v":0.6,"d":"60.00%"}},{"$f":"'1ºP'!B25","v":{"v":0.05,"d":"5.00%"}},"Taxa de Administração  p/Cartão de Débito",{"$f":"IFERROR(B$3*C3*D3,0)","v":{"v":780,"d":"780.00"}},null,{"$f":"'1ºP'!H12","v":"Master Card"},null,"Valor a ser antecipado",null,null,{"$f":"'1ºP'!I40","v":{"v":1170,"d":"1,170.00"}},null,{"$f":"H3","v":"Master Card"}]
[null,null,{"$f":"'1ºP'!B27","v":{"v":0.03,"d":"3.00%"}},{"$f":"'1ºP'!B29","v":{"v":0.02,"d":"2.00%"}},"Taxa de Adm. p/Cartão de Crédito á Vista (30 d)",{"$f":"IFERROR(B$3*C4*D4,0)","v":{"v":15.6,"d":"15.60"}},{"$nulls":3},"Taxa de antecipação",null,null,{"$f":"'1ºP'!B42","v":{"v":0.05,"d":"5.00%"}},null,"Custos Adicionais"]
[null,null,{"$f":"'1ºP'!B31","v":{"v":0.06,"d":"6.00%"}},{"$f":"'1ºP'!B33","v":{"v":0.05,"d":"5.00%"}},"Taxa de Adm. p/Cartão de Crédito Parcelado",{"$f":"IFERROR(B$3*C5*D5,0)","v":{"v":78,"d":"78.00"}},{"$nulls":3},"Período considerado (em dias)",null,null,{"$f":"'1ºP'!B44","v":10},null,"Fixos","Variáveis (Adm.)"]
[null,null,{"$f":"'1ºP'!B35","v":{"v":0.05,"d":"5.00%"}},{"$f":"'1ºP'!B37","v":{"v":0.06,"d":"6.00%"}},"Taxa de Adm. p/Modalidade Crediário (Até 48 v)",{"$f":"IFERROR(B$3*C6*D6,0)","v":{"v":78,"d":"78.00"}},{"$nulls":3},"Período considerado (em meses)",null,null,{"$f":"M5/30","v":{"v":0.3333333333333333,"d":"0.33"}},null,{"$f":"IFERROR('1ºP'!B55+'1ºP'!E55+'1ºP'!H55,0)","v":0},{"$f":"SUM(F3:F6)","v":{"v":951.6,"d":"951.60"}}]
[null,null,{"v":1,"d":"100.00%"},null,"Juros de Antecipação de Recebíveis",{"$f":"M7","v":{"v":18.874268236749685,"d":"18.87"}},{"$nulls":3},"Valor atual",{"$f":"IFERROR(M3/(1+M4)^M6,0)","v":{"v":1151.1257317632503,"d":"1,151.13"}},"Custo Antecip.",{"$f":"IFERROR(M3-K7,0)","v":{"v":18.874268236749685,"d":"18.87"}},null,"Totais",{"$f":"P6+O6+M7","v":{"v":970.4742682367497,"d":"970.47"}}]
[null,{"$f":"'2ºP'!J27","v":{"v":26000,"d":"26,000.00"}},{"$f":"'1ºP'!L23","v":{"v":0.6,"d":"60.00%"}},{"$f":"'1ºP'!L25","v":{"v":0.04,"d":"4.00%"}},"Taxa de Administração  p/Cartão de Débito",{"$f":"IFERROR(B$8*C8*D8,0)","v":{"v":624,"d":"624.00"}},null,{"$f":"'1ºP'!L12","v":"Visa"},null,"Valor a ser antecipado",null,null,{"$f":"'1ºP'!S40","v":{"v":1170,"d":"1,170.00"}},null,{"$f":"H8","v":"Visa"}]
[null,null,{"$f":"'1ºP'!L27","v":{"v":0.03,"d":"3.00%"}},{"$f":"'1ºP'!L29","v":{"v":0.03,"d":"3.00%"}},"Taxa de Adm. p/Cartão de Crédito á Vista (30 d)",{"$f":"IFERROR(B$8*C9*D9,0)","v":{"v":23.4,"d":"23.40"}},{"$nulls":3},"Taxa de antecipação",null,null,{"$f":"'1ºP'!L42","v":{"v":0.07,"d":"7.00%"}},null,"Custos Adicionais"]
[null,null,{"$f":"'1ºP'!L31","v":{"v":0.06,"d":"6.00%"}},{"$f":"'1ºP'!L33","v":{"v":0.04,"d":"4.00%"}},"Taxa de Adm. p/Cartão de Crédito Parcelado",{"$f":"IFERROR(B$8*C10*D10,0)","v":{"v":62.4,"d":"62.40"}},{"$nulls":3},"Período considerado (em dias)",null,null,{"$f":"'1ºP'!L44","v":15},null,"Fixos","Variáveis (Adm.)"]
[null,null,{"$f":"'1ºP'!L35","v":{"v":0.05,"d":"5.00%"}},{"$f":"'1ºP'!L37","v":{"v":0.08,"d":"8.00%"}},"Taxa de Adm. p/Modalidade Crediário (Até 48 v)",{"$f":"IFERROR(B$8*C11*D11,0)","v":{"v":104,"d":"104.00"}},{"$nulls":3},"Período considerado (em meses)",null,null,{"$f":"M10/30","v":{"v":0.5,"d":"0.50"}},null,{"$f":"IFERROR('1ºP'!L55+'1ºP'!O55+'1ºP'!R55,0)","v":0},{"$f":"SUM(F8:F11)","v":{"v":813.8,"d":"813.80"}}]
[null,null,{"v":1,"d":"100.00%"},null,"Juros de Antecipação de Recebíveis",{"$f":"M12","v":{"v":38.91830781657359,"d":"38.92"}},{"$nulls":3},"Valor atual",{"$f":"IFERROR(M8/(1+M9)^M11,0)","v":{"v":1131.0816921834264,"d":"1,131.08"}},"Custo Antecip.",{"$f":"IFERROR(M8-K12,0)","v":{"v":38.91830781657359,"d":"38.92"}},null,"Totais",{"$f":"P11+O11+M12","v":{"v":852.7183078165735,"d":"852.72"}}]
[null,{"$f":"'2ºP'!J27","v":{"v":26000,"d":"26,000.00"}},{"$f":"'1ºP'!B63","v":" "},{"$f":"'1ºP'!B65","v":{"v":0,"d":"0.00%"}},"Taxa de Administração  p/Cartão de Débito",{"$f":"IFERROR(B$13*C13*D13,0)","v":0},null,{"$f":"'1ºP'!O12","v":"Elo"},null,"Valor a ser antecipado",null,null,{"$f":"'1ºP'!I75","v":" "},null,{"$f":"H13","v":"Elo"}]
[null,null,{"$f":"'1ºP'!B67","v":" "},{"$f":"'1ºP'!B69","v":{"v":0,"d":"0.00%"}},"Taxa de Adm. p/Cartão de Crédito á Vista (30 d)",{"$f":"IFERROR(B$13*C14*D14,0)","v":0},{"$nulls":3},"Taxa de antecipação",null,null,{"$f":"'1ºP'!B82","v":{"v":0,"d":"0.00%"}},null,"Custos Adicionais"]
[null,null,{"$f":"'1ºP'!B71","v":" "},{"$f":"'1ºP'!B73","v":{"v":0,"d":"0.00%"}},"Taxa de Adm. p/Cartão de Crédito Parcelado",{"$f":"IFERROR(B$13*C15*D15,0)","v":0},{"$nulls":3},"Período considerado (em dias)",null,null,{"$f":"'1ºP'!B84","v":0},null,"Fixos","Variáveis (Adm.)"]
[null,null,{"$f":"'1ºP'!B75","v":" "},{"$f":"'1ºP'!B77","v":{"v":0,"d":"0.00%"}},"Taxa de Adm. p/Modalidade Crediário (Até 48 v)",{"$f":"IFERROR(B$13*C16*D16,0)","v":0},{"$nulls":3},"Período considerado (em meses)",null,null,{"$f":"M15/30","v":{"v":0,"d":"0.00"}},null,{"$f":"IFERROR('1ºP'!B95+'1ºP'!E95+'1ºP'!H95,0)","v":0},{"$f":"SUM(F13:F16)","v":0}]
[null,null,{"v":1,"d":"100.00%"},null,"Juros de Antecipação de Recebíveis",{"$f":"M17","v":0},{"$nulls":3},"Valor atual",{"$f":"IFERROR(M13/(1+M14)^M16,0)","v":0},"Custo Antecip.",{"$f":"IFERROR(M13-K17,0)","v":0},null,"Totais",{"$f":"P16+O16+M17","v":0}]
[null,{"$f":"'2ºP'!J27","v":{"v":26000,"d":"26,000.00"}},{"$f":"'1ºP'!L63","v":" "},{"$f":"'1ºP'!L65","v":{"v":0,"d":"0.00%"}},"Taxa de Administração  p/Cartão de Débito",{"$f":"IFERROR(B$18*C18*D18,0)","v":0},null,{"$f":"'1ºP'!R12","v":"Cielo"},null,"Valor a ser antecipado",null,null,{"$f":"'1ºP'!S75","v":" "},null,{"$f":"H18","v":"Cielo"}]
[null,null,{"$f":"'1ºP'!L67","v":" "},{"$f":"'1ºP'!L69","v":{"v":0,"d":"0.00%"}},"Taxa de Adm. p/Cartão de Crédito á Vista (30 d)",{"$f":"IFERROR(B$18*C19*D19,0)","v":0},{"$nulls":3},"Taxa de antecipação",null,null,{"$f":"'1ºP'!L82","v":{"v":0,"d":"0.00%"}},null,"Custos Adicionais"]
[null,null,{"$f":"'1ºP'!L71","v":" "},{"$f":"'1ºP'!L73","v":{"v":0,"d":"0.00%"}},"Taxa de Adm. p/Cartão de Crédito Parcelado",{"$f":"IFERROR(B$18*C20*D20,0)","v":0},{"$nulls":3},"Período considerado (em dias)",null,null,{"$f":"'1ºP'!L84","v":0},null,"Fixos","Variáveis"]
[null,null,{"$f":"'1ºP'!L75","v":" "},{"$f":"'1ºP'!L77","v":{"v":0,"d":"0.00%"}},"Taxa de Adm. p/Modalidade Crediário (Até 48 v)",{"$f":"IFERROR(B$18*C21*D21,0)","v":0},{"$nulls":3},"Período considerado (em meses)",null,null,{"$f":"M20/30","v":{"v":0,"d":"0.00"}},null,{"$f":"IFERROR('1ºP'!L95+'1ºP'!O95+'1ºP'!R95,0)","v":0},{"$f":"SUM(F18:F21)","v":0}]
[null,null,{"v":1,"d":"100.00%"},null,"Juros de Antecipação de Recebíveis",{"$f":"M22","v":0},{"$nulls":3},"Valor atual",{"$f":"IFERROR(M18/(1+M19)^M21,0)","v":0},"Custo Antecip.",{"$f":"IFERROR(M18-K22,0)","v":0},null,"Totais",{"$f":"P21+O21+M22","v":0}]