{"text_format":"3","workbook":"xlsx","n_sheets":9,"sheets":["Menu","Veic","Mot","Manut","Frete","Dash","Dash (2)","Dash (3)","Instruções"],"not_rendered":{"charts":10,"images":10,"macros":1,"defined_names":10},"read":"whole","date_system":"1900"}

{"sheet":"Menu","index":0,"n_rows":26,"n_cols":7,"rows_kept":26,"merged":[[25,4,25,5],[25,6,25,14]]}
{"$rows_empty":25}
[{"$nulls":4},"Empresa:",null,"Empresa ABCDE"]

{"sheet":"Veic","index":1,"n_rows":43,"n_cols":19,"rows_kept":43,"merged":[[9,2,9,4],[11,1,11,4]]}
{"$rows_empty":9}
[null,"Empresa:",{"$f":"Menu!G26","v":"Empresa ABCDE"}]
[]
[null,"CADASTROS DE VEÍCULOS\nInsira os dados dos veículos.",{"$nulls":7},{"$f":"SUM(J14:J43)","v":2},{"$f":"SUM(K14:K43)","v":3},null,{"$f":"SUM(M14:M43)","v":{"v":2350,"d":"2,350"}},null,{"$f":"SUM(O14:O43)","v":5},{"$f":"SUM(P14:P43)","v":{"v":40500,"d":"40,500"}},{"$f":"SUM(Q14:Q43)","v":{"v":4400,"d":"4,400"}},{"$f":"SUM(R14:R43)","v":{"v":13950,"d":"13,950"}},{"$f":"SUM(S14:S43)","v":{"v":36100,"d":"36,100"}}]
[null,"ITEM","VEÍCULO","PLACA","RENAVAM",{"$nulls":4},"Preventiva","Corretiva",null,"DespesaManut",null,"Fretes","ReceitasFretes","DespesasFrete","KM Rodado","Saldo"]
[null,1,"CAMINHÃO VW 180","ABC1234",123456789,{"$nulls":4},{"$f":"COUNTIFS(Manut!$D$14:$D$1000,Veic!J$13,Manut!$C$14:$C$1000,Veic!$C14)","v":1},{"$f":"COUNTIFS(Manut!$D$14:$D$1000,Veic!K$13,Manut!$C$14:$C$1000,Veic!$C14)","v":2},null,{"$f":"SUMIF(Manut!$C$14:$C$1000,Veic!C14,Manut!$F$14:$F$1000)","v":{"v":1950,"d":"1,950"}},null,{"$f":"COUNTIF(Frete!$C$14:$C$1000,Veic!C14)","v":3},{"$f":"SUMIF(Frete!$C$14:$C$1000,Veic!C14,Frete!$I$14:$I$1000)","v":{"v":31500,"d":"31,500"}},{"$f":"SUMIF(Frete!$C$14:$C$1000,Veic!C14,Frete!$M$14:$M$1000)","v":{"v":2800,"d":"2,800"}},{"$f":"SUMIF(Frete!$C$14:$C$1000,Veic!C14,Frete!$H$14:$H$1000)","v":{"v":5950,"d":"5,950"}},{"$f":"P14-Q14","v":{"v":28700,"d":"28,700"}}]
[null,2,"UNO FILE 1.0","AAA5555",222222222,{"$nulls":4},{"$f":"COUNTIFS(Manut!$D$14:$D$1000,Veic!J$13,Manut!$C$14:$C$1000,Veic!$C15)","v":1},{"$f":"COUNTIFS(Manut!$D$14:$D$1000,Veic!K$13,Manut!$C$14:$C$1000,Veic!$C15)","v":1},null,{"$f":"SUMIF(Manut!$C$14:$C$1000,Veic!C15,Manut!$F$14:$F$1000)","v":400},null,{"$f":"COUNTIF(Frete!$C$14:$C$1000,Veic!C15)","v":2},{"$f":"SUMIF(Frete!$C$14:$C$1000,Veic!C15,Frete!$I$14:$I$1000)","v":{"v":9000,"d":"9,000"}},{"$f":"SUMIF(Frete!$C$14:$C$1000,Veic!C15,Frete!$M$14:$M$1000)","v":{"v":1600,"d":"1,600"}},{"$f":"SUMIF(Frete!$C$14:$C$1000,Veic!C15,Frete!$H$14:$H$1000)","v":{"v":8000,"d":"8,000"}},{"$f":"P15-Q15","v":{"v":7400,"d":"7,400"}}]
[null,3,{"$nulls":7},{"$f":"COUNTIFS(Manut!$D$14:$D$1000,Veic!J$13,Manut!$C$14:$C$1000,Veic!$C16)","v":0},{"$f":"COUNTIFS(Manut!$D$14:$D$1000,Veic!K$13,Manut!$C$14:$C$1000,Veic!$C16)","v":0},null,{"$f":"SUMIF(Manut!$C$14:$C$1000,Veic!C16,Manut!$F$14:$F$1000)","v":0},null,{"$f":"COUNTIF(Frete!$C$14:$C$1000,Veic!C16)","v":0},{"$f":"SUMIF(Frete!$C$14:$C$1000,Veic!C16,Frete!$I$14:$I$1000)","v":0},{"$f":"SUMIF(Frete!$C$14:$C$1000,Veic!C16,Frete!$M$14:$M$1000)","v":0},{"$f":"SUMIF(Frete!$C$14:$C$1000,Veic!C16,Frete!$H$14:$H$1000)","v":0},0]
[null,4,{"$nulls":7},{"$f":"COUNTIFS(Manut!$D$14:$D$1000,Veic!J$13,Manut!$C$14:$C$1000,Veic!$C17)","v":0},{"$f":"COUNTIFS(Manut!$D$14:$D$1000,Veic!K$13,Manut!$C$14:$C$1000,Veic!$C17)","v":0},null,{"$f":"SUMIF(Manut!$C$14:$C$1000,Veic!C17,Manut!$F$14:$F$1000)","v":0},null,{"$f":"COUNTIF(Frete!$C$14:$C$1000,Veic!C17)","v":0},{"$f":"SUMIF(Frete!$C$14:$C$1000,Veic!C17,Frete!$I$14:$I$1000)","v":0},{"$f":"SUMIF(Frete!$C$14:$C$1000,Veic!C17,Frete!$M$14:$M$1000)","v":0},{"$f":"SUMIF(Frete!$C$14:$C$1000,Veic!C17,Frete!$H$14:$H$1000)","v":0},0]
[null,5,{"$nulls":7},{"$f":"COUNTIFS(Manut!$D$14:$D$1000,Veic!J$13,Manut!$C$14:$C$1000,Veic!$C18)","v":0},{"$f":"COUNTIFS(Manut!$D$14:$D$1000,Veic!K$13,Manut!$C$14:$C$1000,Veic!$C18)","v":0},null,{"$f":"SUMIF(Manut!$C$14:$C$1000,Veic!C18,Manut!$F$14:$F$1000)","v":0},null,{"$f":"COUNTIF(Frete!$C$14:$C$1000,Veic!C18)","v":0},{"$f":"SUMIF(Frete!$C$14:$C$1000,Veic!C18,Frete!$I$14:$I$1000)","v":0},{"$f":"SUMIF(Frete!$C$14:$C$1000,Veic!C18,Frete!$M$14:$M$1000)","v":0},{"$f":"SUMIF(Frete!$C$14:$C$1000,Veic!C18,Frete!$H$14:$H$1000)","v":0},0]
[null,6,{"$nulls":7},{"$f":"COUNTIFS(Manut!$D$14:$D$1000,Veic!J$13,Manut!$C$14:$C$1000,Veic!$C19)","v":0},{"$f":"COUNTIFS(Manut!$D$14:$D$1000,Veic!K$13,Manut!$C$14:$C$1000,Veic!$C19)","v":0},null,{"$f":"SUMIF(Manut!$C$14:$C$1000,Veic!C19,Manut!$F$14:$F$1000)","v":0},null,{"$f":"COUNTIF(Frete!$C$14:$C$1000,Veic!C19)","v":0},{"$f":"SUMIF(Frete!$C$14:$C$1000,Veic!C19,Frete!$I$14:$I$1000)","v":0},{"$f":"SUMIF(Frete!$C$14:$C$1000,Veic!C19,Frete!$M$14:$M$1000)","v":0},{"$f":"SUMIF(Frete!$C$14:$C$1000,Veic!C19,Frete!$H$14:$H$1000)","v":0},0]
[null,7,{"$nulls":7},{"$f":"COUNTIFS(Manut!$D$14:$D$1000,Veic!J$13,Manut!$C$14:$C$1000,Veic!$C20)","v":0},{"$f":"COUNTIFS(Manut!$D$14:$D$1000,Veic!K$13,Manut!$C$14:$C$1000,Veic!$C20)","v":0},null,{"$f":"SUMIF(Manut!$C$14:$C$1000,Veic!C20,Manut!$F$14:$F$1000)","v":0},null,{"$f":"COUNTIF(Frete!$C$14:$C$1000,Veic!C20)","v":0},{"$f":"SUMIF(Frete!$C$14:$C$1000,Veic!C20,Frete!$I$14:$I$1000)","v":0},{"$f":"SUMIF(Frete!$C$14:$C$1000,Veic!C20,Frete!$M$14:$M$1000)","v":0},{"$f":"SUMIF(Frete!$C$14:$C$1000,Veic!C20,Frete!$H$14:$H$1000)","v":0},0]
[null,8,{"$nulls":7},{"$f":"COUNTIFS(Manut!$D$14:$D$1000,Veic!J$13,Manut!$C$14:$C$1000,Veic!$C21)","v":0},{"$f":"COUNTIFS(Manut!$D$14:$D$1000,Veic!K$13,Manut!$C$14:$C$1000,Veic!$C21)","v":0},null,{"$f":"SUMIF(Manut!$C$14:$C$1000,Veic!C21,Manut!$F$14:$F$1000)","v":0},null,{"$f":"COUNTIF(Frete!$C$14:$C$1000,Veic!C21)","v":0},{"$f":"SUMIF(Frete!$C$14:$C$1000,Veic!C21,Frete!$I$14:$I$1000)","v":0},{"$f":"SUMIF(Frete!$C$14:$C$1000,Veic!C21,Frete!$M$14:$M$1000)","v":0},{"$f":"SUMIF(Frete!$C$14:$C$1000,Veic!C21,Frete!$H$14:$H$1000)","v":0},0]
[null,9,{"$nulls":7},{"$f":"COUNTIFS(Manut!$D$14:$D$1000,Veic!J$13,Manut!$C$14:$C$1000,Veic!$C22)","v":0},{"$f":"COUNTIFS(Manut!$D$14:$D$1000,Veic!K$13,Manut!$C$14:$C$1000,Veic!$C22)","v":0},null,{"$f":"SUMIF(Manut!$C$14:$C$1000,Veic!C22,Manut!$F$14:$F$1000)","v":0},null,{"$f":"COUNTIF(Frete!$C$14:$C$1000,Veic!C22)","v":0},{"$f":"SUMIF(Frete!$C$14:$C$1000,Veic!C22,Frete!$I$14:$I$1000)","v":0},{"$f":"SUMIF(Frete!$C$14:$C$1000,Veic!C22,Frete!$M$14:$M$1000)","v":0},{"$f":"SUMIF(Frete!$C$14:$C$1000,Veic!C22,Frete!$H$14:$H$1000)","v":0},0]
[null,10,{"$nulls":7},{"$f":"COUNTIFS(Manut!$D$14:$D$1000,Veic!J$13,Manut!$C$14:$C$1000,Veic!$C23)","v":0},{"$f":"COUNTIFS(Manut!$D$14:$D$1000,Veic!K$13,Manut!$C$14:$C$1000,Veic!$C23)","v":0},null,{"$f":"SUMIF(Manut!$C$14:$C$1000,Veic!C23,Manut!$F$14:$F$1000)","v":0},null,{"$f":"COUNTIF(Frete!$C$14:$C$1000,Veic!C23)","v":0},{"$f":"SUMIF(Frete!$C$14:$C$1000,Veic!C23,Frete!$I$14:$I$1000)","v":0},{"$f":"SUMIF(Frete!$C$14:$C$1000,Veic!C23,Frete!$M$14:$M$1000)","v":0},{"$f":"SUMIF(Frete!$C$14:$C$1000,Veic!C23,Frete!$H$14:$H$1000)","v":0},0]
[null,11,{"$nulls":7},{"$f":"COUNTIFS(Manut!$D$14:$D$1000,Veic!J$13,Manut!$C$14:$C$1000,Veic!$C24)","v":0},{"$f":"COUNTIFS(Manut!$D$14:$D$1000,Veic!K$13,Manut!$C$14:$C$1000,Veic!$C24)","v":0},null,{"$f":"SUMIF(Manut!$C$14:$C$1000,Veic!C24,Manut!$F$14:$F$1000)","v":0},null,{"$f":"COUNTIF(Frete!$C$14:$C$1000,Veic!C24)","v":0},{"$f":"SUMIF(Frete!$C$14:$C$1000,Veic!C24,Frete!$I$14:$I$1000)","v":0},{"$f":"SUMIF(Frete!$C$14:$C$1000,Veic!C24,Frete!$M$14:$M$1000)","v":0},{"$f":"SUMIF(Frete!$C$14:$C$1000,Veic!C24,Frete!$H$14:$H$1000)","v":0},0]
[null,12,{"$nulls":7},{"$f":"COUNTIFS(Manut!$D$14:$D$1000,Veic!J$13,Manut!$C$14:$C$1000,Veic!$C25)","v":0},{"$f":"COUNTIFS(Manut!$D$14:$D$1000,Veic!K$13,Manut!$C$14:$C$1000,Veic!$C25)","v":0},null,{"$f":"SUMIF(Manut!$C$14:$C$1000,Veic!C25,Manut!$F$14:$F$1000)","v":0},null,{"$f":"COUNTIF(Frete!$C$14:$C$1000,Veic!C25)","v":0},{"$f":"SUMIF(Frete!$C$14:$C$1000,Veic!C25,Frete!$I$14:$I$1000)","v":0},{"$f":"SUMIF(Frete!$C$14:$C$1000,Veic!C25,Frete!$M$14:$M$1000)","v":0},{"$f":"SUMIF(Frete!$C$14:$C$1000,Veic!C25,Frete!$H$14:$H$1000)","v":0},0]
[null,13,{"$nulls":7},{"$f":"COUNTIFS(Manut!$D$14:$D$1000,Veic!J$13,Manut!$C$14:$C$1000,Veic!$C26)","v":0},{"$f":"COUNTIFS(Manut!$D$14:$D$1000,Veic!K$13,Manut!$C$14:$C$1000,Veic!$C26)","v":0},null,{"$f":"SUMIF(Manut!$C$14:$C$1000,Veic!C26,Manut!$F$14:$F$1000)","v":0},null,{"$f":"COUNTIF(Frete!$C$14:$C$1000,Veic!C26)","v":0},{"$f":"SUMIF(Frete!$C$14:$C$1000,Veic!C26,Frete!$I$14:$I$1000)","v":0},{"$f":"SUMIF(Frete!$C$14:$C$1000,Veic!C26,Frete!$M$14:$M$1000)","v":0},{"$f":"SUMIF(Frete!$C$14:$C$1000,Veic!C26,Frete!$H$14:$H$1000)","v":0},0]
[null,14,{"$nulls":7},{"$f":"COUNTIFS(Manut!$D$14:$D$1000,Veic!J$13,Manut!$C$14:$C$1000,Veic!$C27)","v":0},{"$f":"COUNTIFS(Manut!$D$14:$D$1000,Veic!K$13,Manut!$C$14:$C$1000,Veic!$C27)","v":0},null,{"$f":"SUMIF(Manut!$C$14:$C$1000,Veic!C27,Manut!$F$14:$F$1000)","v":0},null,{"$f":"COUNTIF(Frete!$C$14:$C$1000,Veic!C27)","v":0},{"$f":"SUMIF(Frete!$C$14:$C$1000,Veic!C27,Frete!$I$14:$I$1000)","v":0},{"$f":"SUMIF(Frete!$C$14:$C$1000,Veic!C27,Frete!$M$14:$M$1000)","v":0},{"$f":"SUMIF(Frete!$C$14:$C$1000,Veic!C27,Frete!$H$14:$H$1000)","v":0},0]
[null,15,{"$nulls":7},{"$f":"COUNTIFS(Manut!$D$14:$D$1000,Veic!J$13,Manut!$C$14:$C$1000,Veic!$C28)","v":0},{"$f":"COUNTIFS(Manut!$D$14:$D$1000,Veic!K$13,Manut!$C$14:$C$1000,Veic!$C28)","v":0},null,{"$f":"SUMIF(Manut!$C$14:$C$1000,Veic!C28,Manut!$F$14:$F$1000)","v":0},null,{"$f":"COUNTIF(Frete!$C$14:$C$1000,Veic!C28)","v":0},{"$f":"SUMIF(Frete!$C$14:$C$1000,Veic!C28,Frete!$I$14:$I$1000)","v":0},{"$f":"SUMIF(Frete!$C$14:$C$1000,Veic!C28,Frete!$M$14:$M$1000)","v":0},{"$f":"SUMIF(Frete!$C$14:$C$1000,Veic!C28,Frete!$H$14:$H$1000)","v":0},0]
{"$rows_left_out":16}
{"sheet":"Mot","index":2,"n_rows":43,"n_cols":21,"rows_kept":43,"merged":[[9,2,9,5],[11,1,11,5]]}
{"$rows_empty":9}
[null,"Empresa:",{"$f":"Menu!G26","v":"Empresa ABCDE"}]
[]
[null,"CADASTROS DE MOTORISTAS\nInsira os dados dos motoristas.",{"$nulls":10},{"$f":"COUNTIF($H$14:$H$43,M$13)","v":2},{"$f":"COUNTIF($H$14:$H$43,N$13)","v":1},{"$f":"COUNTIF($H$14:$H$43,O$13)","v":0},null,{"$f":"SUM(Q14:Q43)","v":5},{"$f":"SUM(R14:R43)","v":{"v":13950,"d":"13,950"}},{"$f":"SUM(S14:S43)","v":{"v":40500,"d":"40,500"}},{"$f":"SUM(T14:T43)","v":{"v":4400,"d":"4,400"}},{"$f":"SUM(U14:U43)","v":{"v":36100,"d":"36,100"}}]
[null,"ITEM","MOTORISTA","TELEFONE","TIPO DE CNH","CNH","VENCIMENTO CNH","STATUS CNH",{"$nulls":4},"CNH VENCIDA","CNH OK","CNH VENCENDO",null,"Fretes","KM Rodado","ReceitasFretes","DespesasFrete","Saldo"]
[null,1,"JOSÉ DA SILVA","9999-9999","D",123456789,"2022-10-27",{"$f":"IF(G14=\"\",\"\",IF(G14<TODAY(),\"CNH VENCIDA\",IF(G14-TODAY()<30,\"CNH VENCENDO\",\"CNH OK\")))","v":"CNH VENCIDA"},{"$nulls":8},{"$f":"COUNTIF(Frete!$D$14:$D$1000,C14)","v":3},{"$f":"SUMIF(Frete!$D$14:$D$1000,C14,Frete!$H$14:$H$1000)","v":{"v":5950,"d":"5,950"}},{"$f":"SUMIF(Frete!$D$14:$D$1000,C14,Frete!$I$14:$I$1000)","v":{"v":31500,"d":"31,500"}},{"$f":"SUMIF(Frete!$D$14:$D$1000,C14,Frete!$M$14:$M$1000)","v":{"v":2800,"d":"2,800"}},{"$f":"S14-T14","v":{"v":28700,"d":"28,700"}}]
[null,2,"JOÃO PAULO ALVES","8888-8888","D",222222222,"2023-08-15",{"$f":"IF(G15=\"\",\"\",IF(G15<TODAY(),\"CNH VENCIDA\",IF(G15-TODAY()<30,\"CNH VENCENDO\",\"CNH OK\")))","v":"CNH VENCIDA"},{"$nulls":8},{"$f":"COUNTIF(Frete!$D$14:$D$1000,C15)","v":2},{"$f":"SUMIF(Frete!$D$14:$D$1000,C15,Frete!$H$14:$H$1000)","v":{"v":8000,"d":"8,000"}},{"$f":"SUMIF(Frete!$D$14:$D$1000,C15,Frete!$I$14:$I$1000)","v":{"v":9000,"d":"9,000"}},{"$f":"SUMIF(Frete!$D$14:$D$1000,C15,Frete!$M$14:$M$1000)","v":{"v":1600,"d":"1,600"}},{"$f":"S15-T15","v":{"v":7400,"d":"7,400"}}]
[null,3,"PEDRO HENRIQUE","7777-7777","AB",5555555,"2024-11-15","CNH OK",{"$nulls":8},{"$f":"COUNTIF(Frete!$D$14:$D$1000,C16)","v":0},{"$f":"SUMIF(Frete!$D$14:$D$1000,C16,Frete!$H$14:$H$1000)","v":0},{"$f":"SUMIF(Frete!$D$14:$D$1000,C16,Frete!$I$14:$I$1000)","v":0},{"$f":"SUMIF(Frete!$D$14:$D$1000,C16,Frete!$M$14:$M$1000)","v":0},0]
[null,4,{"$nulls":5},"",{"$nulls":8},{"$f":"COUNTIF(Frete!$D$14:$D$1000,C17)","v":0},{"$f":"SUMIF(Frete!$D$14:$D$1000,C17,Frete!$H$14:$H$1000)","v":0},{"$f":"SUMIF(Frete!$D$14:$D$1000,C17,Frete!$I$14:$I$1000)","v":0},{"$f":"SUMIF(Frete!$D$14:$D$1000,C17,Frete!$M$14:$M$1000)","v":0},0]
[null,5,{"$nulls":5},"",{"$nulls":8},{"$f":"COUNTIF(Frete!$D$14:$D$1000,C18)","v":0},{"$f":"SUMIF(Frete!$D$14:$D$1000,C18,Frete!$H$14:$H$1000)","v":0},{"$f":"SUMIF(Frete!$D$14:$D$1000,C18,Frete!$I$14:$I$1000)","v":0},{"$f":"SUMIF(Frete!$D$14:$D$1000,C18,Frete!$M$14:$M$1000)","v":0},0]
[null,6,{"$nulls":5},"",{"$nulls":8},{"$f":"COUNTIF(Frete!$D$14:$D$1000,C19)","v":0},{"$f":"SUMIF(Frete!$D$14:$D$1000,C19,Frete!$H$14:$H$1000)","v":0},{"$f":"SUMIF(Frete!$D$14:$D$1000,C19,Frete!$I$14:$I$1000)","v":0},{"$f":"SUMIF(Frete!$D$14:$D$1000,C19,Frete!$M$14:$M$1000)","v":0},0]
[null,7,{"$nulls":5},"",{"$nulls":8},{"$f":"COUNTIF(Frete!$D$14:$D$1000,C20)","v":0},{"$f":"SUMIF(Frete!$D$14:$D$1000,C20,Frete!$H$14:$H$1000)","v":0},{"$f":"SUMIF(Frete!$D$14:$D$1000,C20,Frete!$I$14:$I$1000)","v":0},{"$f":"SUMIF(Frete!$D$14:$D$1000,C20,Frete!$M$14:$M$1000)","v":0},0]
[null,8,{"$nulls":5},"",{"$nulls":8},{"$f":"COUNTIF(Frete!$D$14:$D$1000,C21)","v":0},{"$f":"SUMIF(Frete!$D$14:$D$1000,C21,Frete!$H$14:$H$1000)","v":0},{"$f":"SUMIF(Frete!$D$14:$D$1000,C21,Frete!$I$14:$I$1000)","v":0},{"$f":"SUMIF(Frete!$D$14:$D$1000,C21,Frete!$M$14:$M$1000)","v":0},0]
[null,9,{"$nulls":5},"",{"$nulls":8},{"$f":"COUNTIF(Frete!$D$14:$D$1000,C22)","v":0},{"$f":"SUMIF(Frete!$D$14:$D$1000,C22,Frete!$H$14:$H$1000)","v":0},{"$f":"SUMIF(Frete!$D$14:$D$1000,C22,Frete!$I$14:$I$1000)","v":0},{"$f":"SUMIF(Frete!$D$14:$D$1000,C22,Frete!$M$14:$M$1000)","v":0},0]
[null,10,{"$nulls":5},"",{"$nulls":8},{"$f":"COUNTIF(Frete!$D$14:$D$1000,C23)","v":0},{"$f":"SUMIF(Frete!$D$14:$D$1000,C23,Frete!$H$14:$H$1000)","v":0},{"$f":"SUMIF(Frete!$D$14:$D$1000,C23,Frete!$I$14:$I$1000)","v":0},{"$f":"SUMIF(Frete!$D$14:$D$1000,C23,Frete!$M$14:$M$1000)","v":0},0]
[null,11,{"$nulls":5},"",{"$nulls":8},{"$f":"COUNTIF(Frete!$D$14:$D$1000,C24)","v":0},{"$f":"SUMIF(Frete!$D$14:$D$1000,C24,Frete!$H$14:$H$1000)","v":0},{"$f":"SUMIF(Frete!$D$14:$D$1000,C24,Frete!$I$14:$I$1000)","v":0},{"$f":"SUMIF(Frete!$D$14:$D$1000,C24,Frete!$M$14:$M$1000)","v":0},0]
[null,12,{"$nulls":5},"",{"$nulls":8},{"$f":"COUNTIF(Frete!$D$14:$D$1000,C25)","v":0},{"$f":"SUMIF(Frete!$D$14:$D$1000,C25,Frete!$H$14:$H$1000)","v":0},{"$f":"SUMIF(Frete!$D$14:$D$1000,C25,Frete!$I$14:$I$1000)","v":0},{"$f":"SUMIF(Frete!$D$14:$D$1000,C25,Frete!$M$14:$M$1000)","v":0},0]
[null,13,{"$nulls":5},"",{"$nulls":8},{"$f":"COUNTIF(Frete!$D$14:$D$1000,C26)","v":0},{"$f":"SUMIF(Frete!$D$14:$D$1000,C26,Frete!$H$14:$H$1000)","v":0},{"$f":"SUMIF(Frete!$D$14:$D$1000,C26,Frete!$I$14:$I$1000)","v":0},{"$f":"SUMIF(Frete!$D$14:$D$1000,C26,Frete!$M$14:$M$1000)","v":0},0]
[null,14,{"$nulls":5},"",{"$nulls":8},{"$f":"COUNTIF(Frete!$D$14:$D$1000,C27)","v":0},{"$f":"SUMIF(Frete!$D$14:$D$1000,C27,Frete!$H$14:$H$1000)","v":0},{"$f":"SUMIF(Frete!$D$14:$D$1000,C27,Frete!$I$14:$I$1000)","v":0},{"$f":"SUMIF(Frete!$D$14:$D$1000,C27,Frete!$M$14:$M$1000)","v":0},0]
[null,15,{"$nulls":5},"",{"$nulls":8},{"$f":"COUNTIF(Frete!$D$14:$D$1000,C28)","v":0},{"$f":"SUMIF(Frete!$D$14:$D$1000,C28,Frete!$H$14:$H$1000)","v":0},{"$f":"SUMIF(Frete!$D$14:$D$1000,C28,Frete!$I$14:$I$1000)","v":0},{"$f":"SUMIF(Frete!$D$14:$D$1000,C28,Frete!$M$14:$M$1000)","v":0},0]
{"$rows_left_out":16}
{"sheet":"Manut","index":3,"n_rows":18,"n_cols":6,"rows_kept":18,"merged":[[9,2,9,5],[11,1,11,5]]}
{"$rows_empty":9}
[null,"Empresa:",{"$f":"Menu!G26","v":"Empresa ABCDE"}]
[]
[null,"LANÇAMENTO DE MANUTENÇÕES\nInsira os lançamentos das manutenções preventivas e corretivas realizadas."]
[null,"DATA","VEÍCULO","TIPO DE MANUTEÇÃO","DESCRIÇÃO DA MANUTENÇÃO","VALOR DA MANUTENÇÃO"]
[null,"2024-02-01","CAMINHÃO VW 180","Corretiva","CONSERTO DA EMBREAGEM",{"v":350,"d":"R$350.00"}]
[null,"2024-03-01","CAMINHÃO VW 180","Corretiva","CONSERTO DO MOTOR DE PARTIDA",{"v":600,"d":"R$600.00"}]
[null,"2024-04-01","CAMINHÃO VW 180","Preventiva","TROCA DE ÓLEO",{"v":1000,"d":"R$1,000.00"}]
[null,"2024-04-01","UNO FILE 1.0","Preventiva","TROCA DE ÓLEO",{"v":250,"d":"R$250.00"}]
[null,"2024-05-01","UNO FILE 1.0","Corretiva","CONSERTO DO SISTEMA DE ARREFACIMENTO",{"v":150,"d":"R$150.00"}]

{"sheet":"Frete","index":4,"n_rows":1000,"n_cols":13,"rows_kept":1000,"merged":[[9,2,9,11],[11,1,11,11]]}
{"$rows_empty":9}
[null,"Empresa:",{"$f":"Menu!G26","v":"Empresa ABCDE"}]
[]
[null,"LANÇAMENTO DE FRETES\nInsira os lançamentos dos fretes realizados."]
[null,"DATA","VEÍCULO","MOTORISTA","DESTINO","KM IDA","KM VOLTA","KM RODADO","VALOR FRETE","DESPESAS COMBUSTÍVEL","DESPESAS MULTAS","OUTRAS DESPESAS","TOTAL DESPESAS"]
[null,"2024-02-01","CAMINHÃO VW 180","JOSÉ DA SILVA","SÃO PAULO",{"v":100000,"d":"100,000"},{"v":102000,"d":"102,000"},{"$f":"G14-F14","v":{"v":2000,"d":"2,000"}},{"v":10000,"d":"R$10,000.00"},{"v":500,"d":"R$500.00"},0,{"v":300,"d":"R$300.00"},{"$f":"SUM(J14:L14)","v":{"v":800,"d":"R$800.00"}}]
[null,"2024-03-01","CAMINHÃO VW 180","JOSÉ DA SILVA","SÃO PAULO",{"v":102050,"d":"102,050"},{"v":104000,"d":"104,000"},{"$f":"G15-F15","v":{"v":1950,"d":"1,950"}},{"v":12000,"d":"R$12,000.00"},{"v":800,"d":"R$800.00"},0,{"v":300,"d":"R$300.00"},{"$f":"SUM(J15:L15)","v":{"v":1100,"d":"R$1,100.00"}}]
[null,"2024-04-01","CAMINHÃO VW 180","JOSÉ DA SILVA","SÃO PAULO",{"v":104000,"d":"104,000"},{"v":106000,"d":"106,000"},{"v":2000,"d":"2,000"},{"v":9500,"d":"R$9,500.00"},{"v":600,"d":"R$600.00"},0,{"v":300,"d":"R$300.00"},{"v":900,"d":"R$900.00"}]
[null,"2024-04-01","UNO FILE 1.0","JOÃO PAULO ALVES","PERNAMBUCO",{"v":40000,"d":"40,000"},{"v":44000,"d":"44,000"},{"v":4000,"d":"4,000"},{"v":4000,"d":"R$4,000.00"},{"v":400,"d":"R$400.00"},0,{"v":300,"d":"R$300.00"},{"v":700,"d":"R$700.00"}]
[null,"2024-05-01","UNO FILE 1.0","JOÃO PAULO ALVES","PERNAMBUCO",{"v":44000,"d":"44,000"},{"v":48000,"d":"48,000"},{"v":4000,"d":"4,000"},{"v":5000,"d":"R$5,000.00"},{"v":600,"d":"R$600.00"},0,{"v":300,"d":"R$300.00"},{"v":900,"d":"R$900.00"}]
[{"$nulls":7},0,{"$nulls":4},0]
[{"$nulls":7},0,{"$nulls":4},0]
[{"$nulls":7},0,{"$nulls":4},0]
[{"$nulls":7},0,{"$nulls":4},0]
[{"$nulls":7},0,{"$nulls":4},0]
[{"$nulls":7},0,{"$nulls":4},0]
[{"$nulls":7},0,{"$nulls":4},0]
[{"$nulls":7},0,{"$nulls":4},0]
[{"$nulls":7},0,{"$nulls":4},0]
[{"$nulls":7},0,{"$nulls":4},0]
{"$rows_left_out":973}
{"sheet":"Dash","index":5,"n_rows":11,"n_cols":4,"rows_kept":11,"merged":[[10,1,10,2],[10,3,10,20]]}
{"$rows_empty":10}
[null,"Empresa:",null,{"$f":"Menu!G26","v":"Empresa ABCDE"}]

{"sheet":"Dash (2)","index":6,"n_rows":25,"n_cols":4,"rows_kept":25,"merged":[[10,1,10,2],[10,3,10,20],[13,3,13,8]]}
{"$rows_empty":10}
[null,"Empresa:",null,{"$f":"Menu!G26","v":"Empresa ABCDE"}]
[]
[]
[null,"Selecione o Veículo:",null,"CAMINHÃO VW 180"]
[]
[null,"Preventiva",{"$f":"IFERROR(VLOOKUP(D14,Veic!$C$14:$S$43,8,0),\"\")","v":1}]
[null,"Corretiva",{"$f":"IFERROR(VLOOKUP(D14,Veic!$C$14:$S$43,9,0),\"\")","v":2}]
[]
[null,"DespesaManut",{"$f":"IFERROR(VLOOKUP(D14,Veic!$C$14:$S$43,11,0),\"\")","v":{"v":1950,"d":"R$1,950.00"}}]
[null,"Fretes Realiz",{"$f":"IFERROR(VLOOKUP(D14,Veic!$C$14:$S$43,13,0),\"\")","v":3}]
[null,"KM Rodado",{"$f":"IFERROR(VLOOKUP(D14,Veic!$C$14:$S$43,16,0),\"\")","v":{"v":5950,"d":"5,950"}}]
[]
[null,"Receita",{"$f":"IFERROR(VLOOKUP(D14,Veic!$C$14:$S$43,14,0),\"\")","v":{"v":31500,"d":"R$31,500.00"}}]
[null,"Despesa",{"$f":"IFERROR(VLOOKUP(D14,Veic!$C$14:$S$43,15,0),\"\")","v":{"v":2800,"d":"R$2,800.00"}}]
[null,"Saldo",{"$f":"C23-C24","v":{"v":28700,"d":"R$28,700.00"}}]

{"sheet":"Dash (3)","index":7,"n_rows":25,"n_cols":4,"rows_kept":25,"merged":[[10,1,10,2],[10,3,10,20],[13,3,13,8]]}
{"$rows_empty":10}
[null,"Empresa:",null,{"$f":"Menu!G26","v":"Empresa ABCDE"}]
[]
[]
[null,"Selecione o Motorista:",null,"JOSÉ DA SILVA"]
[]
[]
[]
[null,"Status CNH",{"$f":"IFERROR(VLOOKUP(D14,Mot!$C$14:$U$43,6,0),\"\")","v":"CNH VENCIDA"}]
[]
[null,"Fretes Realiz",{"$f":"IFERROR(VLOOKUP(D14,Mot!$C$14:$U$43,15,0),\"\")","v":3}]
[null,"KM Rodado",{"$f":"IFERROR(VLOOKUP(D14,Mot!$C$14:$U$43,16,0),\"\")","v":{"v":5950,"d":"5,950"}}]
[]
[null,"Receita",{"$f":"IFERROR(VLOOKUP(D14,Mot!$C$14:$U$43,17,0),\"\")","v":{"v":31500,"d":"R$31,500.00"}}]
[null,"Despesa",{"$f":"IFERROR(VLOOKUP(D14,Mot!$C$14:$U$43,18,0),\"\")","v":{"v":2800,"d":"R$2,800.00"}}]
[null,"Saldo",{"$f":"C23-C24","v":{"v":28700,"d":"R$28,700.00"}}]

{"sheet":"Instruções","index":8,"n_rows":0,"n_cols":0,"rows_kept":0}